Period,Provider Parent Code,Provider Parent Name,Prov Org code,Prov Org name,Msac Site Code,Msac Site Name,Commissioner Parent Org Code,Commissioner Parent Name,Comm Org Code,Comm Org name,Msac Breaches
MSA-DECEMBER-2018,Q88,"NHS ENGLAND SOUTH EAST (KENT, SURREY AND SUSSEX)",ADP,KIMS HOSPITAL,NULL,,,,NILRETURN,,0
MSA-DECEMBER-2018,Q86,NHS ENGLAND SOUTH WEST (SOUTH WEST NORTH),AXG,WILTSHIRE HEALTH & CARE,NULL,,,,NILRETURN,,0
MSA-DECEMBER-2018,Q71,NHS ENGLAND LONDON,NDA,VIRGIN CARE SERVICES LTD,NULL,,,,NILRETURN,,0
MSA-DECEMBER-2018,Q72,NHS ENGLAND NORTH (YORKSHIRE AND HUMBER),NL3,CARE PLUS GROUP,NULL,,,,NILRETURN,,0
MSA-DECEMBER-2018,Q72,NHS ENGLAND NORTH (YORKSHIRE AND HUMBER),NL8,LOCALA COMMUNITY PARTNERSHIPS CIC,NULL,,,,NILRETURN,,0
MSA-DECEMBER-2018,Q86,NHS ENGLAND SOUTH WEST (SOUTH WEST NORTH),NLT,NORTH SOMERSET COMMUNITY PARTNERSHIP COMMUNITY INTEREST COMPANY,NULL,,,,NILRETURN,,0
MSA-DECEMBER-2018,Q79,NHS ENGLAND MIDLANDS AND EAST (EAST),NQ1,ANGLIAN COMMUNITY ENTERPRISE COMMUNITY INTEREST COMPANY (ACE CIC),NULL,,,,NILRETURN,,0
MSA-DECEMBER-2018,Q79,NHS ENGLAND MIDLANDS AND EAST (EAST),NQA,PROVIDE,NULL,,,,NILRETURN,,0
MSA-DECEMBER-2018,Q72,NHS ENGLAND NORTH (YORKSHIRE AND HUMBER),NQL,NAVIGO HEALTH AND SOCIAL CARE CIC,NULL,,,,NILRETURN,,0
MSA-DECEMBER-2018,Q75,NHS ENGLAND NORTH (CHESHIRE AND MERSEYSIDE),NQT,VIRGIN CARE LTD,NULL,,,,NILRETURN,,0
MSA-DECEMBER-2018,Q85,NHS ENGLAND SOUTH WEST (SOUTH WEST SOUTH),NR5,LIVEWELL SOUTHWEST,NULL,,,,NILRETURN,,0
MSA-DECEMBER-2018,Q71,NHS ENGLAND LONDON,NT2,NUFFIELD HEALTH,NULL,,,,NILRETURN,,0
MSA-DECEMBER-2018,Q71,NHS ENGLAND LONDON,NT3,SPIRE HEALTHCARE,NULL,,,,NILRETURN,,0
MSA-DECEMBER-2018,Q87,"NHS ENGLAND SOUTH EAST (HAMPSHIRE, ISLE OF WIGHT AND THAMES VALLEY)",NTP,CARE UK,NULL,,,,NILRETURN,,0
MSA-DECEMBER-2018,Q88,"NHS ENGLAND SOUTH EAST (KENT, SURREY AND SUSSEX)",NTV,CSH SURREY,NULL,,,,NILRETURN,,0
MSA-DECEMBER-2018,Q71,NHS ENGLAND LONDON,NV3,CIRCLE,NULL,,,,NILRETURN,,0
MSA-DECEMBER-2018,Q78,NHS ENGLAND MIDLANDS AND EAST (CENTRAL MIDLANDS),NVC,RAMSAY HEALTHCARE UK OPERATIONS LIMITED,NULL,,,,NILRETURN,,0
MSA-DECEMBER-2018,Q75,NHS ENGLAND NORTH (CHESHIRE AND MERSEYSIDE),NVG,FAIRFIELD HOSPITAL,NULL,,,,NILRETURN,,0
MSA-DECEMBER-2018,Q88,"NHS ENGLAND SOUTH EAST (KENT, SURREY AND SUSSEX)",NVM,EPSOMEDICAL GROUP,NULL,,,,NILRETURN,,0
MSA-DECEMBER-2018,Q83,NHS ENGLAND NORTH (GREATER MANCHESTER),R0A,MANCHESTER UNIVERSITY NHS FOUNDATION TRUST,R0A07,Wythenshawe Hospital - R0A07,Q83,NHS ENGLAND NORTH (GREATER MANCHESTER),00Y,NHS OLDHAM CCG,1
MSA-DECEMBER-2018,Q83,NHS ENGLAND NORTH (GREATER MANCHESTER),R0A,MANCHESTER UNIVERSITY NHS FOUNDATION TRUST,R0A07,Wythenshawe Hospital - R0A07,Q75,NHS ENGLAND NORTH (CHESHIRE AND MERSEYSIDE),01F,NHS HALTON CCG,1
MSA-DECEMBER-2018,Q83,NHS ENGLAND NORTH (GREATER MANCHESTER),R0A,MANCHESTER UNIVERSITY NHS FOUNDATION TRUST,R0A07,Wythenshawe Hospital - R0A07,Q83,NHS ENGLAND NORTH (GREATER MANCHESTER),01W,NHS STOCKPORT CCG,1
MSA-DECEMBER-2018,Q83,NHS ENGLAND NORTH (GREATER MANCHESTER),R0A,MANCHESTER UNIVERSITY NHS FOUNDATION TRUST,R0A07,Wythenshawe Hospital - R0A07,Q83,NHS ENGLAND NORTH (GREATER MANCHESTER),02A,NHS TRAFFORD CCG,3
MSA-DECEMBER-2018,Q83,NHS ENGLAND NORTH (GREATER MANCHESTER),R0A,MANCHESTER UNIVERSITY NHS FOUNDATION TRUST,R0A07,Wythenshawe Hospital - R0A07,Q83,NHS ENGLAND NORTH (GREATER MANCHESTER),14L,NHS MANCHESTER CCG,6
MSA-DECEMBER-2018,Q83,NHS ENGLAND NORTH (GREATER MANCHESTER),R0A,MANCHESTER UNIVERSITY NHS FOUNDATION TRUST,R0A02,Manchester Royal Infirmary - R0A02,Q83,NHS ENGLAND NORTH (GREATER MANCHESTER),14L,NHS MANCHESTER CCG,1
MSA-DECEMBER-2018,Q77,NHS ENGLAND MIDLANDS AND EAST (WEST MIDLANDS),R1A,WORCESTERSHIRE HEALTH AND CARE NHS TRUST,NULL,,,,NILRETURN,,0
MSA-DECEMBER-2018,Q87,"NHS ENGLAND SOUTH EAST (HAMPSHIRE, ISLE OF WIGHT AND THAMES VALLEY)",R1C,SOLENT NHS TRUST,NULL,,,,NILRETURN,,0
MSA-DECEMBER-2018,Q76,NHS ENGLAND MIDLANDS AND EAST (NORTH MIDLANDS),R1D,SHROPSHIRE COMMUNITY HEALTH NHS TRUST,NULL,,,,NILRETURN,,0
MSA-DECEMBER-2018,Q87,"NHS ENGLAND SOUTH EAST (HAMPSHIRE, ISLE OF WIGHT AND THAMES VALLEY)",R1F,ISLE OF WIGHT NHS TRUST,R1F01,St Mary's Hospital - R1F01,Q87,"NHS ENGLAND SOUTH EAST (HAMPSHIRE, ISLE OF WIGHT AND THAMES VALLEY)",10L,NHS ISLE OF WIGHT CCG,9
MSA-DECEMBER-2018,Q71,NHS ENGLAND LONDON,R1H,BARTS HEALTH NHS TRUST,R1H12,The Royal London Hospital - R1H12,Q71,NHS ENGLAND LONDON,07X,NHS ENFIELD CCG,1
MSA-DECEMBER-2018,Q71,NHS ENGLAND LONDON,R1H,BARTS HEALTH NHS TRUST,R1H12,The Royal London Hospital - R1H12,Q71,NHS ENGLAND LONDON,08D,NHS HARINGEY CCG,1
MSA-DECEMBER-2018,Q71,NHS ENGLAND LONDON,R1H,BARTS HEALTH NHS TRUST,R1H12,The Royal London Hospital - R1H12,Q71,NHS ENGLAND LONDON,08F,NHS HAVERING CCG,1
MSA-DECEMBER-2018,Q71,NHS ENGLAND LONDON,R1H,BARTS HEALTH NHS TRUST,R1HNH,Newham General Hospital - R1HNH,Q71,NHS ENGLAND LONDON,08M,NHS NEWHAM CCG,11
MSA-DECEMBER-2018,Q71,NHS ENGLAND LONDON,R1H,BARTS HEALTH NHS TRUST,R1H12,The Royal London Hospital - R1H12,Q71,NHS ENGLAND LONDON,08M,NHS NEWHAM CCG,2
MSA-DECEMBER-2018,Q71,NHS ENGLAND LONDON,R1H,BARTS HEALTH NHS TRUST,R1HKH,Whipps Cross University Hospital - R1HKH,Q71,NHS ENGLAND LONDON,08M,NHS NEWHAM CCG,1
MSA-DECEMBER-2018,Q71,NHS ENGLAND LONDON,R1H,BARTS HEALTH NHS TRUST,R1HKH,Whipps Cross University Hospital - R1HKH,Q71,NHS ENGLAND LONDON,08N,NHS REDBRIDGE CCG,1
MSA-DECEMBER-2018,Q71,NHS ENGLAND LONDON,R1H,BARTS HEALTH NHS TRUST,R1HKH,Whipps Cross University Hospital - R1HKH,Q71,NHS ENGLAND LONDON,08V,NHS TOWER HAMLETS CCG,1
MSA-DECEMBER-2018,Q71,NHS ENGLAND LONDON,R1H,BARTS HEALTH NHS TRUST,R1H12,The Royal London Hospital - R1H12,Q71,NHS ENGLAND LONDON,08V,NHS TOWER HAMLETS CCG,1
MSA-DECEMBER-2018,Q71,NHS ENGLAND LONDON,R1H,BARTS HEALTH NHS TRUST,R1HKH,Whipps Cross University Hospital - R1HKH,Q71,NHS ENGLAND LONDON,08W,NHS WALTHAM FOREST CCG,5
MSA-DECEMBER-2018,Q71,NHS ENGLAND LONDON,R1H,BARTS HEALTH NHS TRUST,R1H12,The Royal London Hospital - R1H12,Q71,NHS ENGLAND LONDON,08W,NHS WALTHAM FOREST CCG,1
MSA-DECEMBER-2018,Q86,NHS ENGLAND SOUTH WEST (SOUTH WEST NORTH),R1J,GLOUCESTERSHIRE CARE SERVICES NHS TRUST,NULL,,,,NILRETURN,,0
MSA-DECEMBER-2018,Q71,NHS ENGLAND LONDON,R1K,LONDON NORTH WEST UNIVERSITY HEALTHCARE NHS TRUST,R1K01,Northwick Park Hospital - R1K01,Q78,NHS ENGLAND MIDLANDS AND EAST (CENTRAL MIDLANDS),06K,NHS EAST AND NORTH HERTFORDSHIRE CCG,1
MSA-DECEMBER-2018,Q71,NHS ENGLAND LONDON,R1K,LONDON NORTH WEST UNIVERSITY HEALTHCARE NHS TRUST,R1K01,Northwick Park Hospital - R1K01,Q71,NHS ENGLAND LONDON,07P,NHS BRENT CCG,2
MSA-DECEMBER-2018,Q71,NHS ENGLAND LONDON,R1K,LONDON NORTH WEST UNIVERSITY HEALTHCARE NHS TRUST,R1K01,Northwick Park Hospital - R1K01,Q71,NHS ENGLAND LONDON,07W,NHS EALING CCG,2
MSA-DECEMBER-2018,Q71,NHS ENGLAND LONDON,R1K,LONDON NORTH WEST UNIVERSITY HEALTHCARE NHS TRUST,R1K01,Northwick Park Hospital - R1K01,Q71,NHS ENGLAND LONDON,08E,NHS HARROW CCG,4
MSA-DECEMBER-2018,Q71,NHS ENGLAND LONDON,R1K,LONDON NORTH WEST UNIVERSITY HEALTHCARE NHS TRUST,R1K01,Northwick Park Hospital - R1K01,Q71,NHS ENGLAND LONDON,08G,NHS HILLINGDON CCG,1
MSA-DECEMBER-2018,Q71,NHS ENGLAND LONDON,R1K,LONDON NORTH WEST UNIVERSITY HEALTHCARE NHS TRUST,R1K01,Northwick Park Hospital - R1K01,Q87,"NHS ENGLAND SOUTH EAST (HAMPSHIRE, ISLE OF WIGHT AND THAMES VALLEY)",14Y,NHS BUCKINGHAMSHIRE CCG,1
MSA-DECEMBER-2018,Q79,NHS ENGLAND MIDLANDS AND EAST (EAST),R1L,ESSEX PARTNERSHIP UNIVERSITY NHS FOUNDATION TRUST,NULL,,,,NILRETURN,,0
MSA-DECEMBER-2018,Q88,"NHS ENGLAND SOUTH EAST (KENT, SURREY AND SUSSEX)",RA2,ROYAL SURREY COUNTY HOSPITAL NHS FOUNDATION TRUST,NULL,,,,NILRETURN,,0
MSA-DECEMBER-2018,Q86,NHS ENGLAND SOUTH WEST (SOUTH WEST NORTH),RA3,WESTON AREA HEALTH NHS TRUST,NULL,,,,NILRETURN,,0
MSA-DECEMBER-2018,Q85,NHS ENGLAND SOUTH WEST (SOUTH WEST SOUTH),RA4,YEOVIL DISTRICT HOSPITAL NHS FOUNDATION TRUST,NULL,,,,NILRETURN,,0
MSA-DECEMBER-2018,Q86,NHS ENGLAND SOUTH WEST (SOUTH WEST NORTH),RA7,UNIVERSITY HOSPITALS BRISTOL NHS FOUNDATION TRUST,NULL,,,,NILRETURN,,0
MSA-DECEMBER-2018,Q85,NHS ENGLAND SOUTH WEST (SOUTH WEST SOUTH),RA9,TORBAY AND SOUTH DEVON NHS FOUNDATION TRUST,NULL,,,,NILRETURN,,0
MSA-DECEMBER-2018,Q72,NHS ENGLAND NORTH (YORKSHIRE AND HUMBER),RAE,BRADFORD TEACHING HOSPITALS NHS FOUNDATION TRUST,NULL,,,,NILRETURN,,0
MSA-DECEMBER-2018,Q79,NHS ENGLAND MIDLANDS AND EAST (EAST),RAJ,SOUTHEND UNIVERSITY HOSPITAL NHS FOUNDATION TRUST,NULL,,,,NILRETURN,,0
MSA-DECEMBER-2018,Q71,NHS ENGLAND LONDON,RAL,ROYAL FREE LONDON NHS FOUNDATION TRUST,RAL26,Barnet Hospital - RAL26,Q78,NHS ENGLAND MIDLANDS AND EAST (CENTRAL MIDLANDS),06K,NHS EAST AND NORTH HERTFORDSHIRE CCG,3
MSA-DECEMBER-2018,Q71,NHS ENGLAND LONDON,RAL,ROYAL FREE LONDON NHS FOUNDATION TRUST,RAL01,Royal Free Hospital - RAL01,Q78,NHS ENGLAND MIDLANDS AND EAST (CENTRAL MIDLANDS),06K,NHS EAST AND NORTH HERTFORDSHIRE CCG,2
MSA-DECEMBER-2018,Q71,NHS ENGLAND LONDON,RAL,ROYAL FREE LONDON NHS FOUNDATION TRUST,RAL26,Barnet Hospital - RAL26,Q78,NHS ENGLAND MIDLANDS AND EAST (CENTRAL MIDLANDS),06N,NHS HERTS VALLEYS CCG,12
MSA-DECEMBER-2018,Q71,NHS ENGLAND LONDON,RAL,ROYAL FREE LONDON NHS FOUNDATION TRUST,RAL26,Barnet Hospital - RAL26,Q71,NHS ENGLAND LONDON,07M,NHS BARNET CCG,16
MSA-DECEMBER-2018,Q71,NHS ENGLAND LONDON,RAL,ROYAL FREE LONDON NHS FOUNDATION TRUST,RAL26,Barnet Hospital - RAL26,Q71,NHS ENGLAND LONDON,07P,NHS BRENT CCG,1
MSA-DECEMBER-2018,Q71,NHS ENGLAND LONDON,RAL,ROYAL FREE LONDON NHS FOUNDATION TRUST,RAL01,Royal Free Hospital - RAL01,Q71,NHS ENGLAND LONDON,07P,NHS BRENT CCG,1
MSA-DECEMBER-2018,Q71,NHS ENGLAND LONDON,RAL,ROYAL FREE LONDON NHS FOUNDATION TRUST,RAL26,Barnet Hospital - RAL26,Q71,NHS ENGLAND LONDON,07X,NHS ENFIELD CCG,9
MSA-DECEMBER-2018,Q71,NHS ENGLAND LONDON,RAL,ROYAL FREE LONDON NHS FOUNDATION TRUST,RAL26,Barnet Hospital - RAL26,Q71,NHS ENGLAND LONDON,08D,NHS HARINGEY CCG,1
MSA-DECEMBER-2018,Q71,NHS ENGLAND LONDON,RAN,ROYAL NATIONAL ORTHOPAEDIC HOSPITAL NHS TRUST,RAN01,The Royal National Orthopaedic Hospital (Stanmore) - RAN01,Q84,NHS ENGLAND NORTH (LANCASHIRE AND SOUTH CUMBRIA),01K,NHS MORECAMBE BAY CCG,1
MSA-DECEMBER-2018,Q71,NHS ENGLAND LONDON,RAN,ROYAL NATIONAL ORTHOPAEDIC HOSPITAL NHS TRUST,RAN01,The Royal National Orthopaedic Hospital (Stanmore) - RAN01,Q78,NHS ENGLAND MIDLANDS AND EAST (CENTRAL MIDLANDS),06K,NHS EAST AND NORTH HERTFORDSHIRE CCG,1
MSA-DECEMBER-2018,Q71,NHS ENGLAND LONDON,RAN,ROYAL NATIONAL ORTHOPAEDIC HOSPITAL NHS TRUST,RAN01,The Royal National Orthopaedic Hospital (Stanmore) - RAN01,Q78,NHS ENGLAND MIDLANDS AND EAST (CENTRAL MIDLANDS),06N,NHS HERTS VALLEYS CCG,2
MSA-DECEMBER-2018,Q71,NHS ENGLAND LONDON,RAN,ROYAL NATIONAL ORTHOPAEDIC HOSPITAL NHS TRUST,RAN01,The Royal National Orthopaedic Hospital (Stanmore) - RAN01,Q79,NHS ENGLAND MIDLANDS AND EAST (EAST),06T,NHS NORTH EAST ESSEX CCG,1
MSA-DECEMBER-2018,Q71,NHS ENGLAND LONDON,RAN,ROYAL NATIONAL ORTHOPAEDIC HOSPITAL NHS TRUST,RAN01,The Royal National Orthopaedic Hospital (Stanmore) - RAN01,Q79,NHS ENGLAND MIDLANDS AND EAST (EAST),07K,NHS WEST SUFFOLK CCG,1
MSA-DECEMBER-2018,Q71,NHS ENGLAND LONDON,RAN,ROYAL NATIONAL ORTHOPAEDIC HOSPITAL NHS TRUST,RAN01,The Royal National Orthopaedic Hospital (Stanmore) - RAN01,Q71,NHS ENGLAND LONDON,08E,NHS HARROW CCG,1
MSA-DECEMBER-2018,Q71,NHS ENGLAND LONDON,RAN,ROYAL NATIONAL ORTHOPAEDIC HOSPITAL NHS TRUST,RAN01,The Royal National Orthopaedic Hospital (Stanmore) - RAN01,Q71,NHS ENGLAND LONDON,08F,NHS HAVERING CCG,1
MSA-DECEMBER-2018,Q71,NHS ENGLAND LONDON,RAN,ROYAL NATIONAL ORTHOPAEDIC HOSPITAL NHS TRUST,RAN01,The Royal National Orthopaedic Hospital (Stanmore) - RAN01,Q71,NHS ENGLAND LONDON,08N,NHS REDBRIDGE CCG,1
MSA-DECEMBER-2018,Q71,NHS ENGLAND LONDON,RAN,ROYAL NATIONAL ORTHOPAEDIC HOSPITAL NHS TRUST,RAN01,The Royal National Orthopaedic Hospital (Stanmore) - RAN01,Q71,NHS ENGLAND LONDON,08W,NHS WALTHAM FOREST CCG,1
MSA-DECEMBER-2018,Q71,NHS ENGLAND LONDON,RAN,ROYAL NATIONAL ORTHOPAEDIC HOSPITAL NHS TRUST,RAN01,The Royal National Orthopaedic Hospital (Stanmore) - RAN01,Q88,"NHS ENGLAND SOUTH EAST (KENT, SURREY AND SUSSEX)",09Y,NHS NORTH WEST SURREY CCG,1
MSA-DECEMBER-2018,Q71,NHS ENGLAND LONDON,RAN,ROYAL NATIONAL ORTHOPAEDIC HOSPITAL NHS TRUST,RAN01,The Royal National Orthopaedic Hospital (Stanmore) - RAN01,Q79,NHS ENGLAND MIDLANDS AND EAST (EAST),99E,NHS BASILDON AND BRENTWOOD CCG,1
MSA-DECEMBER-2018,Q71,NHS ENGLAND LONDON,RAP,NORTH MIDDLESEX UNIVERSITY HOSPITAL NHS TRUST,NULL,,,,NILRETURN,,0
MSA-DECEMBER-2018,Q71,NHS ENGLAND LONDON,RAS,THE HILLINGDON HOSPITALS NHS FOUNDATION TRUST,RAS01,Hillingdon Hospital - RAS01,Q71,NHS ENGLAND LONDON,08G,NHS HILLINGDON CCG,4
MSA-DECEMBER-2018,Q71,NHS ENGLAND LONDON,RAS,THE HILLINGDON HOSPITALS NHS FOUNDATION TRUST,RAS02,Mount Vernon Hospital Site - RAS02,Q71,NHS ENGLAND LONDON,08G,NHS HILLINGDON CCG,1
MSA-DECEMBER-2018,Q71,NHS ENGLAND LONDON,RAT,NORTH EAST LONDON NHS FOUNDATION TRUST,NULL,,,,NILRETURN,,0
MSA-DECEMBER-2018,Q71,NHS ENGLAND LONDON,RAX,KINGSTON HOSPITAL NHS FOUNDATION TRUST,NULL,,,,NILRETURN,,0
MSA-DECEMBER-2018,Q85,NHS ENGLAND SOUTH WEST (SOUTH WEST SOUTH),RBA,TAUNTON AND SOMERSET NHS FOUNDATION TRUST,NULL,,,,NILRETURN,,0
MSA-DECEMBER-2018,Q85,NHS ENGLAND SOUTH WEST (SOUTH WEST SOUTH),RBD,DORSET COUNTY HOSPITAL NHS FOUNDATION TRUST,RBD01,Dorset County Hospital - RBD01,Q85,NHS ENGLAND SOUTH WEST (SOUTH WEST SOUTH),11J,NHS DORSET CCG,3
MSA-DECEMBER-2018,Q77,NHS ENGLAND MIDLANDS AND EAST (WEST MIDLANDS),RBK,WALSALL HEALTHCARE NHS TRUST,RBK02,Manor Hospital - RBK02,Q76,NHS ENGLAND MIDLANDS AND EAST (NORTH MIDLANDS),04Y,NHS CANNOCK CHASE CCG,1
MSA-DECEMBER-2018,Q77,NHS ENGLAND MIDLANDS AND EAST (WEST MIDLANDS),RBK,WALSALL HEALTHCARE NHS TRUST,RBK02,Manor Hospital - RBK02,Q77,NHS ENGLAND MIDLANDS AND EAST (WEST MIDLANDS),05Y,NHS WALSALL CCG,1
MSA-DECEMBER-2018,Q75,NHS ENGLAND NORTH (CHESHIRE AND MERSEYSIDE),RBL,WIRRAL UNIVERSITY TEACHING HOSPITAL NHS FOUNDATION TRUST,RBL14,Arrowe Park Hospital - RBL14,Q75,NHS ENGLAND NORTH (CHESHIRE AND MERSEYSIDE),12F,NHS WIRRAL CCG,15
MSA-DECEMBER-2018,Q75,NHS ENGLAND NORTH (CHESHIRE AND MERSEYSIDE),RBN,ST HELENS AND KNOWSLEY TEACHING HOSPITALS NHS TRUST,NULL,,,,NILRETURN,,0
MSA-DECEMBER-2018,Q75,NHS ENGLAND NORTH (CHESHIRE AND MERSEYSIDE),RBQ,LIVERPOOL HEART AND CHEST HOSPITAL NHS FOUNDATION TRUST,NULL,,,,NILRETURN,,0
MSA-DECEMBER-2018,Q75,NHS ENGLAND NORTH (CHESHIRE AND MERSEYSIDE),RBS,ALDER HEY CHILDREN'S NHS FOUNDATION TRUST,NULL,,,,NILRETURN,,0
MSA-DECEMBER-2018,Q75,NHS ENGLAND NORTH (CHESHIRE AND MERSEYSIDE),RBT,MID CHESHIRE HOSPITALS NHS FOUNDATION TRUST,NULL,,,,NILRETURN,,0
MSA-DECEMBER-2018,Q83,NHS ENGLAND NORTH (GREATER MANCHESTER),RBV,THE CHRISTIE NHS FOUNDATION TRUST,NULL,,,,NILRETURN,,0
MSA-DECEMBER-2018,Q85,NHS ENGLAND SOUTH WEST (SOUTH WEST SOUTH),RBZ,NORTHERN DEVON HEALTHCARE NHS TRUST,NULL,,,,NILRETURN,,0
MSA-DECEMBER-2018,Q78,NHS ENGLAND MIDLANDS AND EAST (CENTRAL MIDLANDS),RC1,BEDFORD HOSPITAL NHS TRUST,RC110,Bedford Hospital South Wing - RC110,Q78,NHS ENGLAND MIDLANDS AND EAST (CENTRAL MIDLANDS),06F,NHS BEDFORDSHIRE CCG,8
MSA-DECEMBER-2018,Q78,NHS ENGLAND MIDLANDS AND EAST (CENTRAL MIDLANDS),RC1,BEDFORD HOSPITAL NHS TRUST,RC110,Bedford Hospital South Wing - RC110,,,X24,NHS ENGLAND,1
MSA-DECEMBER-2018,Q78,NHS ENGLAND MIDLANDS AND EAST (CENTRAL MIDLANDS),RC9,LUTON AND DUNSTABLE UNIVERSITY HOSPITAL NHS FOUNDATION TRUST,NULL,,,,NILRETURN,,0
MSA-DECEMBER-2018,Q72,NHS ENGLAND NORTH (YORKSHIRE AND HUMBER),RCB,YORK TEACHING HOSPITAL NHS FOUNDATION TRUST,NULL,,,,NILRETURN,,0
MSA-DECEMBER-2018,Q72,NHS ENGLAND NORTH (YORKSHIRE AND HUMBER),RCD,HARROGATE AND DISTRICT NHS FOUNDATION TRUST,NULL,,,,NILRETURN,,0
MSA-DECEMBER-2018,Q72,NHS ENGLAND NORTH (YORKSHIRE AND HUMBER),RCF,AIREDALE NHS FOUNDATION TRUST,NULL,,,,NILRETURN,,0
MSA-DECEMBER-2018,Q72,NHS ENGLAND NORTH (YORKSHIRE AND HUMBER),RCU,SHEFFIELD CHILDREN'S NHS FOUNDATION TRUST,NULL,,,,NILRETURN,,0
MSA-DECEMBER-2018,Q79,NHS ENGLAND MIDLANDS AND EAST (EAST),RCX,"THE QUEEN ELIZABETH HOSPITAL, KING'S LYNN, NHS FOUNDATION TRUST",RCX70,The Queen Elizabeth Hospital - RCX70,Q79,NHS ENGLAND MIDLANDS AND EAST (EAST),06H,NHS CAMBRIDGESHIRE AND PETERBOROUGH CCG,1
MSA-DECEMBER-2018,Q79,NHS ENGLAND MIDLANDS AND EAST (EAST),RCX,"THE QUEEN ELIZABETH HOSPITAL, KING'S LYNN, NHS FOUNDATION TRUST",RCX70,The Queen Elizabeth Hospital - RCX70,Q79,NHS ENGLAND MIDLANDS AND EAST (EAST),07J,NHS WEST NORFOLK CCG,1
MSA-DECEMBER-2018,Q86,NHS ENGLAND SOUTH WEST (SOUTH WEST NORTH),RD1,ROYAL UNITED HOSPITALS BATH NHS FOUNDATION TRUST,NULL,,,,NILRETURN,,0
MSA-DECEMBER-2018,Q85,NHS ENGLAND SOUTH WEST (SOUTH WEST SOUTH),RD3,POOLE HOSPITAL NHS FOUNDATION TRUST,NULL,,,,NILRETURN,,0
MSA-DECEMBER-2018,Q78,NHS ENGLAND MIDLANDS AND EAST (CENTRAL MIDLANDS),RD8,MILTON KEYNES UNIVERSITY HOSPITAL NHS FOUNDATION TRUST,NULL,,,,NILRETURN,,0
MSA-DECEMBER-2018,Q79,NHS ENGLAND MIDLANDS AND EAST (EAST),RDD,BASILDON AND THURROCK UNIVERSITY HOSPITALS NHS FOUNDATION TRUST,NULL,,,,NILRETURN,,0
MSA-DECEMBER-2018,Q79,NHS ENGLAND MIDLANDS AND EAST (EAST),RDE,EAST SUFFOLK AND NORTH ESSEX NHS FOUNDATION TRUST,NULL,,,,NILRETURN,,0
MSA-DECEMBER-2018,Q88,"NHS ENGLAND SOUTH EAST (KENT, SURREY AND SUSSEX)",RDR,SUSSEX COMMUNITY NHS FOUNDATION TRUST,NULL,,,,NILRETURN,,0
MSA-DECEMBER-2018,Q87,"NHS ENGLAND SOUTH EAST (HAMPSHIRE, ISLE OF WIGHT AND THAMES VALLEY)",RDU,FRIMLEY HEALTH NHS FOUNDATION TRUST,RDU01,Frimley Park Hospital - RDU01,Q76,NHS ENGLAND MIDLANDS AND EAST (NORTH MIDLANDS),05V,NHS STAFFORD AND SURROUNDS CCG,1
MSA-DECEMBER-2018,Q87,"NHS ENGLAND SOUTH EAST (HAMPSHIRE, ISLE OF WIGHT AND THAMES VALLEY)",RDU,FRIMLEY HEALTH NHS FOUNDATION TRUST,RDU01,Frimley Park Hospital - RDU01,Q79,NHS ENGLAND MIDLANDS AND EAST (EAST),06Y,NHS SOUTH NORFOLK CCG,1
MSA-DECEMBER-2018,Q87,"NHS ENGLAND SOUTH EAST (HAMPSHIRE, ISLE OF WIGHT AND THAMES VALLEY)",RDU,FRIMLEY HEALTH NHS FOUNDATION TRUST,RDU01,Frimley Park Hospital - RDU01,Q71,NHS ENGLAND LONDON,08A,NHS GREENWICH CCG,1
MSA-DECEMBER-2018,Q87,"NHS ENGLAND SOUTH EAST (HAMPSHIRE, ISLE OF WIGHT AND THAMES VALLEY)",RDU,FRIMLEY HEALTH NHS FOUNDATION TRUST,RDU01,Frimley Park Hospital - RDU01,Q71,NHS ENGLAND LONDON,08G,NHS HILLINGDON CCG,1
MSA-DECEMBER-2018,Q87,"NHS ENGLAND SOUTH EAST (HAMPSHIRE, ISLE OF WIGHT AND THAMES VALLEY)",RDU,FRIMLEY HEALTH NHS FOUNDATION TRUST,RDU01,Frimley Park Hospital - RDU01,Q71,NHS ENGLAND LONDON,08P,NHS RICHMOND CCG,1
MSA-DECEMBER-2018,Q87,"NHS ENGLAND SOUTH EAST (HAMPSHIRE, ISLE OF WIGHT AND THAMES VALLEY)",RDU,FRIMLEY HEALTH NHS FOUNDATION TRUST,RDU01,Frimley Park Hospital - RDU01,Q88,"NHS ENGLAND SOUTH EAST (KENT, SURREY AND SUSSEX)",09N,NHS GUILDFORD AND WAVERLEY CCG,12
MSA-DECEMBER-2018,Q87,"NHS ENGLAND SOUTH EAST (HAMPSHIRE, ISLE OF WIGHT AND THAMES VALLEY)",RDU,FRIMLEY HEALTH NHS FOUNDATION TRUST,RDU01,Frimley Park Hospital - RDU01,Q88,"NHS ENGLAND SOUTH EAST (KENT, SURREY AND SUSSEX)",09Y,NHS NORTH WEST SURREY CCG,14
MSA-DECEMBER-2018,Q87,"NHS ENGLAND SOUTH EAST (HAMPSHIRE, ISLE OF WIGHT AND THAMES VALLEY)",RDU,FRIMLEY HEALTH NHS FOUNDATION TRUST,RDU50,Wexham Park Hospital - RDU50,Q88,"NHS ENGLAND SOUTH EAST (KENT, SURREY AND SUSSEX)",09Y,NHS NORTH WEST SURREY CCG,1
MSA-DECEMBER-2018,Q87,"NHS ENGLAND SOUTH EAST (HAMPSHIRE, ISLE OF WIGHT AND THAMES VALLEY)",RDU,FRIMLEY HEALTH NHS FOUNDATION TRUST,RDU01,Frimley Park Hospital - RDU01,Q87,"NHS ENGLAND SOUTH EAST (HAMPSHIRE, ISLE OF WIGHT AND THAMES VALLEY)",10C,NHS SURREY HEATH CCG,58
MSA-DECEMBER-2018,Q87,"NHS ENGLAND SOUTH EAST (HAMPSHIRE, ISLE OF WIGHT AND THAMES VALLEY)",RDU,FRIMLEY HEALTH NHS FOUNDATION TRUST,RDU01,Frimley Park Hospital - RDU01,Q87,"NHS ENGLAND SOUTH EAST (HAMPSHIRE, ISLE OF WIGHT AND THAMES VALLEY)",10J,NHS NORTH HAMPSHIRE CCG,13
MSA-DECEMBER-2018,Q87,"NHS ENGLAND SOUTH EAST (HAMPSHIRE, ISLE OF WIGHT AND THAMES VALLEY)",RDU,FRIMLEY HEALTH NHS FOUNDATION TRUST,RDU01,Frimley Park Hospital - RDU01,Q87,"NHS ENGLAND SOUTH EAST (HAMPSHIRE, ISLE OF WIGHT AND THAMES VALLEY)",10R,NHS PORTSMOUTH CCG,1
MSA-DECEMBER-2018,Q87,"NHS ENGLAND SOUTH EAST (HAMPSHIRE, ISLE OF WIGHT AND THAMES VALLEY)",RDU,FRIMLEY HEALTH NHS FOUNDATION TRUST,RDU01,Frimley Park Hospital - RDU01,Q87,"NHS ENGLAND SOUTH EAST (HAMPSHIRE, ISLE OF WIGHT AND THAMES VALLEY)",10V,NHS SOUTH EASTERN HAMPSHIRE CCG,4
MSA-DECEMBER-2018,Q87,"NHS ENGLAND SOUTH EAST (HAMPSHIRE, ISLE OF WIGHT AND THAMES VALLEY)",RDU,FRIMLEY HEALTH NHS FOUNDATION TRUST,RDU01,Frimley Park Hospital - RDU01,Q87,"NHS ENGLAND SOUTH EAST (HAMPSHIRE, ISLE OF WIGHT AND THAMES VALLEY)",10X,NHS SOUTHAMPTON CCG,1
MSA-DECEMBER-2018,Q87,"NHS ENGLAND SOUTH EAST (HAMPSHIRE, ISLE OF WIGHT AND THAMES VALLEY)",RDU,FRIMLEY HEALTH NHS FOUNDATION TRUST,RDU01,Frimley Park Hospital - RDU01,Q87,"NHS ENGLAND SOUTH EAST (HAMPSHIRE, ISLE OF WIGHT AND THAMES VALLEY)",11A,NHS WEST HAMPSHIRE CCG,3
MSA-DECEMBER-2018,Q87,"NHS ENGLAND SOUTH EAST (HAMPSHIRE, ISLE OF WIGHT AND THAMES VALLEY)",RDU,FRIMLEY HEALTH NHS FOUNDATION TRUST,RDU01,Frimley Park Hospital - RDU01,Q86,NHS ENGLAND SOUTH WEST (SOUTH WEST NORTH),11E,NHS BATH AND NORTH EAST SOMERSET CCG,2
MSA-DECEMBER-2018,Q87,"NHS ENGLAND SOUTH EAST (HAMPSHIRE, ISLE OF WIGHT AND THAMES VALLEY)",RDU,FRIMLEY HEALTH NHS FOUNDATION TRUST,RDU01,Frimley Park Hospital - RDU01,Q87,"NHS ENGLAND SOUTH EAST (HAMPSHIRE, ISLE OF WIGHT AND THAMES VALLEY)",14Y,NHS BUCKINGHAMSHIRE CCG,1
MSA-DECEMBER-2018,Q87,"NHS ENGLAND SOUTH EAST (HAMPSHIRE, ISLE OF WIGHT AND THAMES VALLEY)",RDU,FRIMLEY HEALTH NHS FOUNDATION TRUST,RDU50,Wexham Park Hospital - RDU50,Q87,"NHS ENGLAND SOUTH EAST (HAMPSHIRE, ISLE OF WIGHT AND THAMES VALLEY)",14Y,NHS BUCKINGHAMSHIRE CCG,16
MSA-DECEMBER-2018,Q87,"NHS ENGLAND SOUTH EAST (HAMPSHIRE, ISLE OF WIGHT AND THAMES VALLEY)",RDU,FRIMLEY HEALTH NHS FOUNDATION TRUST,RDU01,Frimley Park Hospital - RDU01,Q87,"NHS ENGLAND SOUTH EAST (HAMPSHIRE, ISLE OF WIGHT AND THAMES VALLEY)",15A,NHS BERKSHIRE WEST CCG,5
MSA-DECEMBER-2018,Q87,"NHS ENGLAND SOUTH EAST (HAMPSHIRE, ISLE OF WIGHT AND THAMES VALLEY)",RDU,FRIMLEY HEALTH NHS FOUNDATION TRUST,RDU50,Wexham Park Hospital - RDU50,Q87,"NHS ENGLAND SOUTH EAST (HAMPSHIRE, ISLE OF WIGHT AND THAMES VALLEY)",15A,NHS BERKSHIRE WEST CCG,2
MSA-DECEMBER-2018,Q87,"NHS ENGLAND SOUTH EAST (HAMPSHIRE, ISLE OF WIGHT AND THAMES VALLEY)",RDU,FRIMLEY HEALTH NHS FOUNDATION TRUST,RDU01,Frimley Park Hospital - RDU01,Q87,"NHS ENGLAND SOUTH EAST (HAMPSHIRE, ISLE OF WIGHT AND THAMES VALLEY)",15D,NHS EAST BERKSHIRE CCG,40
MSA-DECEMBER-2018,Q87,"NHS ENGLAND SOUTH EAST (HAMPSHIRE, ISLE OF WIGHT AND THAMES VALLEY)",RDU,FRIMLEY HEALTH NHS FOUNDATION TRUST,RDU50,Wexham Park Hospital - RDU50,Q87,"NHS ENGLAND SOUTH EAST (HAMPSHIRE, ISLE OF WIGHT AND THAMES VALLEY)",15D,NHS EAST BERKSHIRE CCG,72
MSA-DECEMBER-2018,Q87,"NHS ENGLAND SOUTH EAST (HAMPSHIRE, ISLE OF WIGHT AND THAMES VALLEY)",RDU,FRIMLEY HEALTH NHS FOUNDATION TRUST,RDU01,Frimley Park Hospital - RDU01,Q88,"NHS ENGLAND SOUTH EAST (KENT, SURREY AND SUSSEX)",99H,NHS SURREY DOWNS CCG,1
MSA-DECEMBER-2018,Q87,"NHS ENGLAND SOUTH EAST (HAMPSHIRE, ISLE OF WIGHT AND THAMES VALLEY)",RDU,FRIMLEY HEALTH NHS FOUNDATION TRUST,RDU01,Frimley Park Hospital - RDU01,Q87,"NHS ENGLAND SOUTH EAST (HAMPSHIRE, ISLE OF WIGHT AND THAMES VALLEY)",99M,NHS NORTH EAST HAMPSHIRE AND FARNHAM CCG,183
MSA-DECEMBER-2018,Q87,"NHS ENGLAND SOUTH EAST (HAMPSHIRE, ISLE OF WIGHT AND THAMES VALLEY)",RDU,FRIMLEY HEALTH NHS FOUNDATION TRUST,RDU01,Frimley Park Hospital - RDU01,Q85,NHS ENGLAND SOUTH WEST (SOUTH WEST SOUTH),99P,"NHS NORTHERN, EASTERN AND WESTERN DEVON CCG",1
MSA-DECEMBER-2018,Q87,"NHS ENGLAND SOUTH EAST (HAMPSHIRE, ISLE OF WIGHT AND THAMES VALLEY)",RDU,FRIMLEY HEALTH NHS FOUNDATION TRUST,RDU50,Wexham Park Hospital - RDU50,,,NONC,,1
MSA-DECEMBER-2018,Q85,NHS ENGLAND SOUTH WEST (SOUTH WEST SOUTH),RDY,DORSET HEALTHCARE UNIVERSITY NHS FOUNDATION TRUST,NULL,,,,NILRETURN,,0
MSA-DECEMBER-2018,Q85,NHS ENGLAND SOUTH WEST (SOUTH WEST SOUTH),RDZ,THE ROYAL BOURNEMOUTH AND CHRISTCHURCH HOSPITALS NHS FOUNDATION TRUST,NULL,,,,NILRETURN,,0