{"text_format":"1","workbook":"xlsx","n_sheets":6,"sheets":["National & Regional Team","Provider - Site","Provider - All","Provider - By Type","Commissioner","Notes"],"not_rendered":{"charts":0,"images":0,"macros":1,"external_links":0,"defined_names":28,"comments":0,"pivot_tables":0},"unopened":[],"bounds":{"document_bytes":16777216,"sheet_cells":100000,"rows_first":2000,"rows_last":500,"rows_between":2000,"halvings":0,"cell_chars":16384,"cell_head_chars":4096},"cells_cut":0,"cells_raw":0,"read":"whole","date_system":"1900"}

{"sheet":"National & Regional Team","index":0,"n_rows":31,"n_cols":6,"rows_kept":31,"cut":false,"hidden":false,"merged":[[35,1,37,5],[28,1,28,5],[30,1,30,5],[32,1,32,5],[26,1,26,5]]}
[]
[null,"Title:","Mixed-Sex Accommodation"]
[null,"Summary:","The total occurrences of unjustified mixing in relation to sleeping accommodation."]
[]
[null,"Period:","September 2019"]
[null,"Sources:","MSA, collected via SDCS, NHS England and NHS Improvement (MSA breaches)"]
[null,null,"Hospital Episode Statistics (HES), NHS Digital (FCE data)"]
[null,"Basis:","Provider"]
[null,"Published:","14th November 2019"]
[null,"Revised:","-"]
[null,"Status:","Published"]
[null,"Contact:","Katie Tither - england.nhsdata@nhs.net"]
[]
[null,"National & Regional Level Data"]
[null,"Region Code","Region Name","MSA Breaches1","Finished Consultant Episodes2\n(from previous year)","Breach Rate3"]
[null,"-","England",1595,1650167,{"$f":"ROUND(D16*1000/E16,1)","v":1}]
[]
[null,"Y56","London Commissioning Region",241,260340,{"$f":"ROUND(D18*1000/E18,1)","v":0.9}]
[null,"Y58","South West Commissioning Region",201,165150,{"$f":"ROUND(D19*1000/E19,1)","v":1.2}]
[null,"Y59","South East Commissioning Region",682,224165,3]
[null,"Y60","Midlands Commissioning Region",158,300190,0.5]
[null,"Y61","East of England Commissioning Region",64,190285,0.3]
[null,"Y62","North West Commissioning Region",227,226785,1]
[null,"Y63","North East and Yorkshire Commissioning Region",22,261355,0.1]
[]
[null,"Notes:"]
[null,"1. In September 2019 a revised policy, \"Delivering same-sex accommodation\" was published. Data providers were asked to ensure reporting of MSA breaches for the purposes of this collection were in line with the revised policy by January 2020. This transition period allows providers to make appropriate changes to enable them to report on this basis. As such this may impact on data quality for September - December 2019 data. Providers should all be reporting consistently and as per the updated guidance by January 2020. "]
[]
[null,"2. Finished Consultant Episode (FCE) data from Hospital Episode Statistics (HES) are used to calculate the MSA breach rate (for further details on methodology of this calculation see footnote 2). The FCE data presented here are a snapshot of latest HES data available at the time of the MSA publication for the relevant data period (due to timings of HES publication in some months this will represent \"final\" HES data, however for some months this is \"provisional\" HES data). These are used solely for the purposes of calculating an MSA breach rate to allow comparisons across providers and of change over time.\n\nFrom 2017/18 onwards, at the point of publication of MSA revisions (every 6 months), the FCE denominator is updated to reflect final HES data where available so is subject to change and may not match always the published HES timeseries (where provisional data is updated on a monthly basis).  The official and most recent timeseries of HES data is available on the NHS Digital website which will reflect any more recent updates to the provisional HES FCE data. https://digital.nhs.uk/data-and-information/publications/statistical/hospital-episode-statistics-for-admitted-patient-care-outpatient-and-accident-and-emergency-data\n\nRegional level FCE data is displayed accordance with HES disclosure control methodology. \nhttps://digital.nhs.uk/binaries/content/assets/website-assets/data-and-information/data-tools-and-services/data-services/hospital-episode-statistics/hes_analysis_guide_september_2018-v1.1.pdf\n\nHES Disclosure Control\nIn order to protect patient confidentiality '*' appears in the table above for all sub-national breakdowns, where it is possible to calculate a value between 1 and 7 from the data presented. All other sub-national data has been rounded to the nearest 5.\n\nIf the national total is between 1 and 7 (inclusive), no sub-national breakdown will be displayed. \n\nIf the national total is greater than or equal to 8;\na. Sub-national counts between 1 and 7 (inclusive) will be displayed as ’*’.\nb. Zeroes will be unchanged.\nc. All other counts will be rounded to the nearest 5."]
[]
[null,"3. The MSA breach rate is the number of MSA breaches, per 1,000 finished consultant episodes. Due to timeliness of HES data, there is one year’s lag in the denominator data, compared to the MSA breaches. For example, the breach rate for June 2019 is calculated by dividing the total MSA breaches in June 2019 (numerator) by the number of Finished Consultant Episodes in June 2018 (denominator). As such, it is only an estimation. Please see Breach Rate methodology paper for further information via: http://www.england.nhs.uk/statistics/mixed-sex-accommodation/\n\nWhen calculating rates or percentages at regional level using HES data;\n1) Where the numerator or denominator is between 1 and 7 (inclusive), no percentage or rate is calculated, and a ’*’ will be displayed.\n2) Where the numerator is zero, the percentage will be 0%.\n3) Where the unrounded numerator and denominator are greater than or equal to 8, a percentage or rate is calculated using the rounded numerator or denominator.\n4).Where no denominator data is available, no percentage or rate is calculated, and ’N/A’ will be displayed."]

{"sheet":"Provider - Site","index":1,"n_rows":103,"n_cols":8,"rows_kept":103,"cut":false,"hidden":false,"merged":[[98,1,98,7],[100,1,100,7],[102,1,102,7],[96,1,96,7]]}
[]
[null,"Title:","Mixed-Sex Accommodation"]
[null,"Summary:","The total occurrences of unjustified mixing in relation to sleeping accommodation."]
[]
[null,"Period:",{"$f":"Publicationmonth","v":"September 2019"}]
[null,"Sources:",{"$f":"'National & Regional Team'!C6","v":"MSA, collected via SDCS, NHS England and NHS Improvement (MSA breaches)"}]
[null,null,{"$f":"'National & Regional Team'!C7","v":"Hospital Episode Statistics (HES), NHS Digital (FCE data)"}]
[null,"Basis:","Provider"]
[null,"Published:",{"$f":"Publicationdate","v":"14th November 2019"}]
[null,"Revised:","-"]
[null,"Status:","Published"]
[null,"Contact:","Katie Tither - england.nhsdata@nhs.net"]
[]
[null,"Provider by Site Data"]
[null,"Region Code","Region Name","Organisation Code","Organisation Name","Hospital Code","Hospital Site Name","MSA Breaches1,2,3,4"]
[null,"-","-","-","England","-","-",{"$f":"SUM(H18:H94)","v":1595}]
[]
[null,"Y56",{"$f":"VLOOKUP(B18,'Provider - All'!B:C,2,0)","v":"London Commissioning Region"},"RF4",{"$f":"VLOOKUP(D18,'Provider - All'!D:E,2,0)","v":"Barking, Havering and Redbridge University Hospitals NHS Trust"},"RF4QH","Queen's Hospital - RF4QH",12]
[null,"Y56",{"$f":"VLOOKUP(B19,'Provider - All'!B:C,2,0)","v":"London Commissioning Region"},"R1H",{"$f":"VLOOKUP(D19,'Provider - All'!D:E,2,0)","v":"Barts Health NHS Trust"},"R1HNH","Newham General Hospital - R1HNH",2]
[null,"Y56",{"$f":"VLOOKUP(B20,'Provider - All'!B:C,2,0)","v":"London Commissioning Region"},"R1H",{"$f":"VLOOKUP(D20,'Provider - All'!D:E,2,0)","v":"Barts Health NHS Trust"},"R1H12","The Royal London Hospital - R1H12",3]
[null,"Y56",{"$f":"VLOOKUP(B21,'Provider - All'!B:C,2,0)","v":"London Commissioning Region"},"R1H",{"$f":"VLOOKUP(D21,'Provider - All'!D:E,2,0)","v":"Barts Health NHS Trust"},"R1HKH","Whipps Cross University Hospital - R1HKH",17]
[null,"Y56",{"$f":"VLOOKUP(B22,'Provider - All'!B:C,2,0)","v":"London Commissioning Region"},"RVR",{"$f":"VLOOKUP(D22,'Provider - All'!D:E,2,0)","v":"Epsom and St Helier University Hospitals NHS Trust"},"RVR50","Epsom Hospital - RVR50",3]
[null,"Y56",{"$f":"VLOOKUP(B23,'Provider - All'!B:C,2,0)","v":"London Commissioning Region"},"RVR",{"$f":"VLOOKUP(D23,'Provider - All'!D:E,2,0)","v":"Epsom and St Helier University Hospitals NHS Trust"},"RVR05","St Helier Hospital - RVR05",3]
[null,"Y56",{"$f":"VLOOKUP(B24,'Provider - All'!B:C,2,0)","v":"London Commissioning Region"},"RJ1",{"$f":"VLOOKUP(D24,'Provider - All'!D:E,2,0)","v":"Guy's and St Thomas' NHS Foundation Trust"},"RJ121","Guy's Hospital - RJ121",3]
[null,"Y56",{"$f":"VLOOKUP(B25,'Provider - All'!B:C,2,0)","v":"London Commissioning Region"},"RJ1",{"$f":"VLOOKUP(D25,'Provider - All'!D:E,2,0)","v":"Guy's and St Thomas' NHS Foundation Trust"},"RJ122","St Thomas' Hospital - RJ122",26]
[null,"Y56",{"$f":"VLOOKUP(B26,'Provider - All'!B:C,2,0)","v":"London Commissioning Region"},"RYJ",{"$f":"VLOOKUP(D26,'Provider - All'!D:E,2,0)","v":"Imperial College Healthcare NHS Trust"},"RYJ02","Charing Cross Hospital - RYJ02",9]
[null,"Y56",{"$f":"VLOOKUP(B27,'Provider - All'!B:C,2,0)","v":"London Commissioning Region"},"RYJ",{"$f":"VLOOKUP(D27,'Provider - All'!D:E,2,0)","v":"Imperial College Healthcare NHS Trust"},"RYJ03","Hammersmith Hospital - RYJ03",5]
[null,"Y56",{"$f":"VLOOKUP(B28,'Provider - All'!B:C,2,0)","v":"London Commissioning Region"},"RYJ",{"$f":"VLOOKUP(D28,'Provider - All'!D:E,2,0)","v":"Imperial College Healthcare NHS Trust"},"RYJ01","St Mary's Hospital (HQ) - RYJ01",14]
[null,"Y56",{"$f":"VLOOKUP(B29,'Provider - All'!B:C,2,0)","v":"London Commissioning Region"},"R1K",{"$f":"VLOOKUP(D29,'Provider - All'!D:E,2,0)","v":"London North West University Healthcare NHS Trust"},"R1K01","Northwick Park Hospital - R1K01",13]
[null,"Y56",{"$f":"VLOOKUP(B30,'Provider - All'!B:C,2,0)","v":"London Commissioning Region"},"RAL",{"$f":"VLOOKUP(D30,'Provider - All'!D:E,2,0)","v":"Royal Free London NHS Foundation Trust"},"RAL26","Barnet Hospital - RAL26",32]
[null,"Y56",{"$f":"VLOOKUP(B31,'Provider - All'!B:C,2,0)","v":"London Commissioning Region"},"RAL",{"$f":"VLOOKUP(D31,'Provider - All'!D:E,2,0)","v":"Royal Free London NHS Foundation Trust"},"RAL01","Royal Free Hospital - RAL01",14]
[null,"Y56",{"$f":"VLOOKUP(B32,'Provider - All'!B:C,2,0)","v":"London Commissioning Region"},"RAL",{"$f":"VLOOKUP(D32,'Provider - All'!D:E,2,0)","v":"Royal Free London NHS Foundation Trust"},"RAL16","Royal National Throat, Nose and Ear Hospital - RAL16",12]
[null,"Y56",{"$f":"VLOOKUP(B33,'Provider - All'!B:C,2,0)","v":"London Commissioning Region"},"RAS",{"$f":"VLOOKUP(D33,'Provider - All'!D:E,2,0)","v":"The Hillingdon Hospitals NHS Foundation Trust"},"RAS01","Hillingdon Hospital - RAS01",31]
[null,"Y56",{"$f":"VLOOKUP(B34,'Provider - All'!B:C,2,0)","v":"London Commissioning Region"},"RRV",{"$f":"VLOOKUP(D34,'Provider - All'!D:E,2,0)","v":"University College London Hospitals NHS Foundation Trust"},"RRV03","University College Hospital - RRV03",41]
[null,"Y56",{"$f":"VLOOKUP(B35,'Provider - All'!B:C,2,0)","v":"London Commissioning Region"},"RKE",{"$f":"VLOOKUP(D35,'Provider - All'!D:E,2,0)","v":"Whittington Health NHS Trust"},"RKEQ4","The Whittington Hospital - RKEQ4",1]
[null,"Y58",{"$f":"VLOOKUP(B36,'Provider - All'!B:C,2,0)","v":"South West Commissioning Region"},"RVN",{"$f":"VLOOKUP(D36,'Provider - All'!D:E,2,0)","v":"Avon and Wiltshire Mental Health Partnership NHS Trust"},"RVNCE","The Victoria Centre - RVNCE",2]
[null,"Y58",{"$f":"VLOOKUP(B37,'Provider - All'!B:C,2,0)","v":"South West Commissioning Region"},"RBD",{"$f":"VLOOKUP(D37,'Provider - All'!D:E,2,0)","v":"Dorset County Hospital NHS Foundation Trust"},"RBD01","Dorset County Hospital - RBD01",6]
[null,"Y58",{"$f":"VLOOKUP(B38,'Provider - All'!B:C,2,0)","v":"South West Commissioning Region"},"RTE",{"$f":"VLOOKUP(D38,'Provider - All'!D:E,2,0)","v":"Gloucestershire Hospitals NHS Foundation Trust"},"RTE01","Cheltenham General Hospital - RTE01",9]
[null,"Y58",{"$f":"VLOOKUP(B39,'Provider - All'!B:C,2,0)","v":"South West Commissioning Region"},"RTE",{"$f":"VLOOKUP(D39,'Provider - All'!D:E,2,0)","v":"Gloucestershire Hospitals NHS Foundation Trust"},"RTE03","Gloucestershire Royal Hospital - RTE03",36]
[null,"Y58",{"$f":"VLOOKUP(B40,'Provider - All'!B:C,2,0)","v":"South West Commissioning Region"},"RN3",{"$f":"VLOOKUP(D40,'Provider - All'!D:E,2,0)","v":"Great Western Hospitals NHS Foundation Trust"},"RN325","The Great Western Hospital - RN325",21]
{"$rows_left_out":64}
{"sheet":"Provider - All","index":2,"n_rows":256,"n_cols":8,"rows_kept":256,"cut":false,"hidden":false,"merged":[[249,1,249,7],[259,1,260,7],[257,1,257,7],[251,1,251,7],[253,1,253,7],[255,1,255,7]]}
[]
[null,"Title:","Mixed-Sex Accommodation"]
[null,"Summary:","The total occurrences of unjustified mixing in relation to sleeping accommodation."]
[]
[null,"Period:","September 2019"]
[null,"Sources:","MSA, collected via SDCS, NHS England and NHS Improvement (MSA breaches)"]
[null,null,"Hospital Episode Statistics (HES), NHS Digital (FCE data)"]
[null,"Basis:","Provider"]
[null,"Published:","14th November 2019"]
[null,"Revised:","-"]
[null,"Status:","Published"]
[null,"Contact:","Katie Tither - england.nhsdata@nhs.net"]
[]
[null,"Provider Level Data"]
[null,"Region Code","Region Name","Organisation Code","Organisation Name","MSA Breaches1","Finished Consultant Episodes2\n(from previous year)","Breach Rate3,4"]
[null,"-","-","-","England",1595,1650167,{"$f":"ROUND(F16*1000/G16,1)","v":1}]
[]
[null,"Y56","London Commissioning Region","NT2","Nuffield Health",0,2965,{"$f":"(IF(G18=\"*\",\"*\",IF(ISERROR(F18*1000/G18),\"N/A\",ROUND(F18*1000/G18,1))))","v":0}]
[null,"Y56","London Commissioning Region","NT3","Spire Healthcare",0,6565,{"$f":"(IF(G19=\"*\",\"*\",IF(ISERROR(F19*1000/G19),\"N/A\",ROUND(F19*1000/G19,1))))","v":0}]
[null,"Y56","London Commissioning Region","NV3","Circle",0,3215,0]
[null,"Y56","London Commissioning Region","R1H","Barts Health NHS Trust",22,26275,0.8]
[null,"Y56","London Commissioning Region","R1K","London North West University Healthcare NHS Trust",13,18685,0.7]
[null,"Y56","London Commissioning Region","RAL","Royal Free London NHS Foundation Trust",58,15875,3.7]
[null,"Y56","London Commissioning Region","RAN","Royal National Orthopaedic Hospital NHS Trust",0,1290,0]
[null,"Y56","London Commissioning Region","RAP","North Middlesex University Hospital NHS Trust",0,7405,0]
[null,"Y56","London Commissioning Region","RAS","The Hillingdon Hospitals NHS Foundation Trust",31,5930,5.2]
[null,"Y56","London Commissioning Region","RAT","North East London NHS Foundation Trust",0,235,0]
[null,"Y56","London Commissioning Region","RAX","Kingston Hospital NHS Foundation Trust",0,7490,0]
[null,"Y56","London Commissioning Region","RF4","Barking, Havering and Redbridge University Hospitals NHS Trust",12,12500,1]
[null,"Y56","London Commissioning Region","RJ1","Guy's and St Thomas' NHS Foundation Trust",29,14870,2]
[null,"Y56","London Commissioning Region","RJ2","Lewisham and Greenwich NHS Trust",0,13765,0]
[null,"Y56","London Commissioning Region","RJ6","Croydon Health Services NHS Trust",0,6690,0]
[null,"Y56","London Commissioning Region","RJ7","St George's University Hospitals NHS Foundation Trust",0,14135,0]
[null,"Y56","London Commissioning Region","RJZ","King's College Hospital NHS Foundation Trust",0,21795,0]
[null,"Y56","London Commissioning Region","RKE","Whittington Health NHS Trust",1,4520,0.2]
[null,"Y56","London Commissioning Region","RKL","West London NHS Trust",0,"N/A","N/A"]
[null,"Y56","London Commissioning Region","RP4","Great Ormond Street Hospital For Children NHS Foundation Trust",0,4315,0]
[null,"Y56","London Commissioning Region","RPG","Oxleas NHS Foundation Trust",0,205,0]
[null,"Y56","London Commissioning Region","RPY","The Royal Marsden NHS Foundation Trust",0,1860,0]
[null,"Y56","London Commissioning Region","RQM","Chelsea and Westminster Hospital NHS Foundation Trust",0,12740,0]
{"$rows_left_out":217}
{"sheet":"Provider - By Type","index":3,"n_rows":267,"n_cols":8,"rows_kept":267,"cut":false,"hidden":false,"merged":[[268,1,268,7],[262,1,262,7],[264,1,264,7],[266,1,266,7],[260,1,260,7]]}
[]
[null,"Title:","Mixed-Sex Accommodation"]
[null,"Summary:","The total occurrences of unjustified mixing in relation to sleeping accommodation."]
[]
[null,"Period:","September 2019"]
[null,"Sources:","MSA, collected via SDCS, NHS England and NHS Improvement (MSA breaches)"]
[null,null,"Hospital Episode Statistics (HES), NHS Digital (FCE data)"]
[null,"Basis:","Provider"]
[null,"Published:","14th November 2019"]
[null,"Revised:","-"]
[null,"Status:","Published"]
[null,"Contact:","Katie Tither - england.nhsdata@nhs.net"]
[]
[null,"Acute Provider Level Data"]
[null,"Region Code","Region Name","Organisation Code","Organisation Name","MSA Breaches1","Finished Consultant Episodes2\n(from previous year)","Breach Rate3,4"]
[null,"-","-","-","All Acute Providers",1575,1579075,{"$f":"ROUND(F16*1000/G16,1)","v":1}]
[]
[null,"Y56","London Commissioning Region","RF4","Barking, Havering And Redbridge University Hospitals NHS Trust",12,12500,{"$f":"IF(G18=\"*\",\"*\",IF(ISERROR(F18*1000/G18),\"N/A\",(ROUND(F18*1000/G18,1))))","v":1}]
[null,"Y56","London Commissioning Region","R1H","Barts Health NHS Trust",22,26275,{"$f":"IF(G19=\"*\",\"*\",IF(ISERROR(F19*1000/G19),\"N/A\",(ROUND(F19*1000/G19,1))))","v":0.8}]
[null,"Y56","London Commissioning Region","RQM","Chelsea And Westminster Hospital NHS Foundation Trust",0,12740,0]
[null,"Y56","London Commissioning Region","RJ6","Croydon Health Services NHS Trust",0,6690,0]
[null,"Y56","London Commissioning Region","RVR","Epsom And St Helier University Hospitals NHS Trust",6,9725,0.6]
[null,"Y56","London Commissioning Region","RP4","Great Ormond Street Hospital For Children NHS Foundation Trust",0,4315,0]
[null,"Y56","London Commissioning Region","RJ1","Guy's And St Thomas' NHS Foundation Trust",29,14870,2]
[null,"Y56","London Commissioning Region","RQX","Homerton University Hospital NHS Foundation Trust",0,6800,0]
[null,"Y56","London Commissioning Region","RYJ","Imperial College Healthcare NHS Trust",28,20390,1.4]
[null,"Y56","London Commissioning Region","RJZ","King's College Hospital NHS Foundation Trust",0,21795,0]
[null,"Y56","London Commissioning Region","RAX","Kingston Hospital NHS Foundation Trust",0,7490,0]
[null,"Y56","London Commissioning Region","RJ2","Lewisham And Greenwich NHS Trust",0,13765,0]
[null,"Y56","London Commissioning Region","R1K","London North West University Healthcare NHS Trust",13,18685,0.7]
[null,"Y56","London Commissioning Region","RAP","North Middlesex University Hospital NHS Trust",0,7405,0]
[null,"Y56","London Commissioning Region","RT3","Royal Brompton & Harefield NHS Foundation Trust",0,3590,0]
[null,"Y56","London Commissioning Region","RAL","Royal Free London NHS Foundation Trust",58,15875,3.7]
[null,"Y56","London Commissioning Region","RAN","Royal National Orthopaedic Hospital NHS Trust",0,1290,0]
[null,"Y56","London Commissioning Region","RJ7","St George's University Hospitals NHS Foundation Trust",0,14135,0]
[null,"Y56","London Commissioning Region","RAS","The Hillingdon Hospitals NHS Foundation Trust",31,5930,5.2]
[null,"Y56","London Commissioning Region","RPY","The Royal Marsden NHS Foundation Trust",0,1860,0]
[null,"Y56","London Commissioning Region","RRV","University College London Hospitals NHS Foundation Trust",41,14705,2.8]
[null,"Y56","London Commissioning Region","RKE","Whittington Health NHS Trust",1,4520,0.2]
[null,"Y58","South West Commissioning Region","RBD","Dorset County Hospital NHS Foundation Trust",6,5195,1.2]
{"$rows_left_out":228}
{"sheet":"Commissioner","index":4,"n_rows":217,"n_cols":8,"rows_kept":217,"cut":false,"hidden":false,"merged":[[220,1,221,7],[214,1,214,7],[216,1,216,7],[218,1,218,7],[212,1,212,7]]}
[]
[null,"Title:","Mixed-Sex Accommodation"]
[null,"Summary:","The total occurrences of unjustified mixing in relation to sleeping accommodation."]
[]
[null,"Period:","September 2019"]
[null,"Sources:","MSA, collected via SDCS, NHS England and NHS Improvement (MSA breaches)"]
[null,null,"Hospital Episode Statistics (HES), NHS Digital (FCE data)"]
[null,"Basis:","Commissioner"]
[null,"Published:","14th November 2019"]
[null,"Revised:","-"]
[null,"Status:","Published"]
[null,"Contact:","Katie Tither - england.nhsdata@nhs.net"]
[]
[null,"Commissioner Level Data"]
[null,"Region Code","Region Name","Organisation Code","Organisation Name","MSA Breaches1","Finished Consultant Episodes2\n(from previous year)","Breach Rate3"]
[null,"-","-","-","England",1595,1650167,{"$f":"ROUND(F16*1000/G16,1)","v":1}]
[]
[null,"-","-","X24","NHS England",19,"N/A",{"$f":"IF(G18=\"*\",\"*\",IF(ISERROR(F18*1000/G18),\"N/A\",(ROUND(F18*1000/G18,1))))","v":"N/A"}]
[null,"-","-","NONC","Non English Commissioner",10,"N/A",{"$f":"IF(G19=\"*\",\"*\",IF(ISERROR(F19*1000/G19),\"N/A\",(ROUND(F19*1000/G19,1))))","v":"N/A"}]
[null,"Y56","London Commissioning Region","07L","NHS Barking And Dagenham CCG",4,4890,0.8]
[null,"Y56","London Commissioning Region","07M","NHS Barnet CCG",21,9250,2.2999999999999998]
[null,"Y56","London Commissioning Region","07N","NHS Bexley CCG",2,6785,0.3]
[null,"Y56","London Commissioning Region","07P","NHS Brent CCG",7,10100,0.7]
[null,"Y56","London Commissioning Region","07Q","NHS Bromley CCG",2,9730,0.2]
[null,"Y56","London Commissioning Region","07R","NHS Camden CCG",11,5415,2]
[null,"Y56","London Commissioning Region","09A","NHS Central London (Westminster) CCG",3,4175,0.7]
[null,"Y56","London Commissioning Region","07T","NHS City And Hackney CCG",4,7205,0.6]
[null,"Y56","London Commissioning Region","07V","NHS Croydon CCG",0,9880,0]
[null,"Y56","London Commissioning Region","07W","NHS Ealing CCG",11,10965,1]
[null,"Y56","London Commissioning Region","07X","NHS Enfield CCG",20,8210,2.4]
[null,"Y56","London Commissioning Region","08A","NHS Greenwich CCG",2,7790,0.3]
[null,"Y56","London Commissioning Region","08C","NHS Hammersmith And Fulham CCG",7,4960,1.4]
[null,"Y56","London Commissioning Region","08D","NHS Haringey CCG",3,7085,0.4]
[null,"Y56","London Commissioning Region","08E","NHS Harrow CCG",6,8000,0.8]
[null,"Y56","London Commissioning Region","08F","NHS Havering CCG",10,7135,1.4]
[null,"Y56","London Commissioning Region","08G","NHS Hillingdon CCG",20,7785,2.6]
[null,"Y56","London Commissioning Region","07Y","NHS Hounslow CCG",5,7020,0.7]
[null,"Y56","London Commissioning Region","08H","NHS Islington CCG",8,5405,1.5]
[null,"Y56","London Commissioning Region","08J","NHS Kingston CCG",0,4500,0]
[null,"Y56","London Commissioning Region","08K","NHS Lambeth CCG",2,8450,0.2]
{"$rows_left_out":178}
{"sheet":"Notes","index":5,"n_rows":40,"n_cols":2,"rows_kept":40,"cut":false,"hidden":false,"merged":[]}
[]
[]
[]
[]
[]
[]
[]
[]
[]
[]
[]
[]
[]
[]
[]
[]
[]
[]
[]
[]
[]
[]
[]
[]
[]
[]
[]
[]
[]
[]
[]
[]
[]
[]
[]
[]
[]
[]
[1,"https://improvement.nhs.uk/documents/6005/Delivering_same_sex_accommodation_sep2019.pdf"]
[2,"https://www.england.nhs.uk/statistics/wp-content/uploads/sites/2/2019/10/MSA-Guidance-v1.5.pdf"]