Period,Provider Parent Code,Provider Parent Name,Prov Org code,Prov Org name,Msac Site Code,Msac Site Name,Commissioner Parent Org Code,Commissioner Parent Name,Comm Org Code,Comm Org name,Msac Breaches
MSA-APRIL-2019,Q88,"NHS ENGLAND SOUTH EAST (KENT, SURREY AND SUSSEX)",ADP,KIMS HOSPITAL,NULL,,,,NILRETURN,,0
MSA-APRIL-2019,Q86,NHS ENGLAND SOUTH WEST (SOUTH WEST NORTH),AXG,WILTSHIRE HEALTH & CARE,NULL,,,,NILRETURN,,0
MSA-APRIL-2019,Q71,NHS ENGLAND LONDON,NDA,VIRGIN CARE SERVICES LTD,NULL,,,,NILRETURN,,0
MSA-APRIL-2019,Q72,NHS ENGLAND NORTH (YORKSHIRE AND HUMBER),NL3,CARE PLUS GROUP,NULL,,,,NILRETURN,,0
MSA-APRIL-2019,Q72,NHS ENGLAND NORTH (YORKSHIRE AND HUMBER),NL8,LOCALA COMMUNITY PARTNERSHIPS CIC,NULL,,,,NILRETURN,,0
MSA-APRIL-2019,Q86,NHS ENGLAND SOUTH WEST (SOUTH WEST NORTH),NLT,NORTH SOMERSET COMMUNITY PARTNERSHIP COMMUNITY INTEREST COMPANY,NULL,,,,NILRETURN,,0
MSA-APRIL-2019,Q79,NHS ENGLAND MIDLANDS AND EAST (EAST),NQ1,ANGLIAN COMMUNITY ENTERPRISE COMMUNITY INTEREST COMPANY (ACE CIC),NULL,,,,NILRETURN,,0
MSA-APRIL-2019,Q79,NHS ENGLAND MIDLANDS AND EAST (EAST),NQA,PROVIDE,NULL,,,,NILRETURN,,0
MSA-APRIL-2019,Q72,NHS ENGLAND NORTH (YORKSHIRE AND HUMBER),NQL,NAVIGO HEALTH AND SOCIAL CARE CIC,NULL,,,,NILRETURN,,0
MSA-APRIL-2019,Q75,NHS ENGLAND NORTH (CHESHIRE AND MERSEYSIDE),NQT,VIRGIN CARE LTD,NULL,,,,NILRETURN,,0
MSA-APRIL-2019,Q85,NHS ENGLAND SOUTH WEST (SOUTH WEST SOUTH),NR5,LIVEWELL SOUTHWEST,NULL,,,,NILRETURN,,0
MSA-APRIL-2019,Q71,NHS ENGLAND LONDON,NT2,NUFFIELD HEALTH,NULL,,,,NILRETURN,,0
MSA-APRIL-2019,Q71,NHS ENGLAND LONDON,NT3,SPIRE HEALTHCARE,NULL,,,,NILRETURN,,0
MSA-APRIL-2019,Q87,"NHS ENGLAND SOUTH EAST (HAMPSHIRE, ISLE OF WIGHT AND THAMES VALLEY)",NTP,CARE UK,NULL,,,,NILRETURN,,0
MSA-APRIL-2019,Q88,"NHS ENGLAND SOUTH EAST (KENT, SURREY AND SUSSEX)",NTV,CSH SURREY,NULL,,,,NILRETURN,,0
MSA-APRIL-2019,Q71,NHS ENGLAND LONDON,NV3,CIRCLE,NULL,,,,NILRETURN,,0
MSA-APRIL-2019,Q79,NHS ENGLAND MIDLANDS AND EAST (EAST),NVC,RAMSAY HEALTHCARE UK OPERATIONS LIMITED,NULL,,,,NILRETURN,,0
MSA-APRIL-2019,Q75,NHS ENGLAND NORTH (CHESHIRE AND MERSEYSIDE),NVG,FAIRFIELD HOSPITAL,NULL,,,,NILRETURN,,0
MSA-APRIL-2019,Q88,"NHS ENGLAND SOUTH EAST (KENT, SURREY AND SUSSEX)",NVM,EPSOMEDICAL GROUP,NULL,,,,NILRETURN,,0
MSA-APRIL-2019,Q83,NHS ENGLAND NORTH (GREATER MANCHESTER),R0A,MANCHESTER UNIVERSITY NHS FOUNDATION TRUST,NULL,,,,NILRETURN,,0
MSA-APRIL-2019,Q74,NHS ENGLAND NORTH (CUMBRIA AND NORTH EAST),R0B,SOUTH TYNESIDE AND SUNDERLAND NHS FOUNDATION TRUST,NULL,,,,NILRETURN,,0
MSA-APRIL-2019,Q77,NHS ENGLAND MIDLANDS AND EAST (WEST MIDLANDS),R1A,WORCESTERSHIRE HEALTH AND CARE NHS TRUST,NULL,,,,NILRETURN,,0
MSA-APRIL-2019,Q87,"NHS ENGLAND SOUTH EAST (HAMPSHIRE, ISLE OF WIGHT AND THAMES VALLEY)",R1C,SOLENT NHS TRUST,NULL,,,,NILRETURN,,0
MSA-APRIL-2019,Q76,NHS ENGLAND MIDLANDS AND EAST (NORTH MIDLANDS),R1D,SHROPSHIRE COMMUNITY HEALTH NHS TRUST,NULL,,,,NILRETURN,,0
MSA-APRIL-2019,Q87,"NHS ENGLAND SOUTH EAST (HAMPSHIRE, ISLE OF WIGHT AND THAMES VALLEY)",R1F,ISLE OF WIGHT NHS TRUST,R1F01,St Mary's Hospital - R1F01,Q87,"NHS ENGLAND SOUTH EAST (HAMPSHIRE, ISLE OF WIGHT AND THAMES VALLEY)",10L,NHS ISLE OF WIGHT CCG,22
MSA-APRIL-2019,Q71,NHS ENGLAND LONDON,R1H,BARTS HEALTH NHS TRUST,R1HKH,Whipps Cross University Hospital - R1HKH,Q79,NHS ENGLAND MIDLANDS AND EAST (EAST),07H,NHS WEST ESSEX CCG,2
MSA-APRIL-2019,Q71,NHS ENGLAND LONDON,R1H,BARTS HEALTH NHS TRUST,R1HNH,Newham General Hospital - R1HNH,Q71,NHS ENGLAND LONDON,07L,NHS BARKING AND DAGENHAM CCG,1
MSA-APRIL-2019,Q71,NHS ENGLAND LONDON,R1H,BARTS HEALTH NHS TRUST,R1H12,The Royal London Hospital - R1H12,Q71,NHS ENGLAND LONDON,07X,NHS ENFIELD CCG,1
MSA-APRIL-2019,Q71,NHS ENGLAND LONDON,R1H,BARTS HEALTH NHS TRUST,R1HNH,Newham General Hospital - R1HNH,Q71,NHS ENGLAND LONDON,08M,NHS NEWHAM CCG,7
MSA-APRIL-2019,Q71,NHS ENGLAND LONDON,R1H,BARTS HEALTH NHS TRUST,R1HKH,Whipps Cross University Hospital - R1HKH,Q71,NHS ENGLAND LONDON,08N,NHS REDBRIDGE CCG,4
MSA-APRIL-2019,Q71,NHS ENGLAND LONDON,R1H,BARTS HEALTH NHS TRUST,R1HKH,Whipps Cross University Hospital - R1HKH,Q71,NHS ENGLAND LONDON,08W,NHS WALTHAM FOREST CCG,4
MSA-APRIL-2019,Q86,NHS ENGLAND SOUTH WEST (SOUTH WEST NORTH),R1J,GLOUCESTERSHIRE CARE SERVICES NHS TRUST,NULL,,,,NILRETURN,,0
MSA-APRIL-2019,Q71,NHS ENGLAND LONDON,R1K,LONDON NORTH WEST UNIVERSITY HEALTHCARE NHS TRUST,R1K01,Northwick Park Hospital - R1K01,Q78,NHS ENGLAND MIDLANDS AND EAST (CENTRAL MIDLANDS),04G,NHS NENE CCG,1
MSA-APRIL-2019,Q71,NHS ENGLAND LONDON,R1K,LONDON NORTH WEST UNIVERSITY HEALTHCARE NHS TRUST,R1K01,Northwick Park Hospital - R1K01,Q79,NHS ENGLAND MIDLANDS AND EAST (EAST),06F,NHS BEDFORDSHIRE CCG,2
MSA-APRIL-2019,Q71,NHS ENGLAND LONDON,R1K,LONDON NORTH WEST UNIVERSITY HEALTHCARE NHS TRUST,R1K01,Northwick Park Hospital - R1K01,Q79,NHS ENGLAND MIDLANDS AND EAST (EAST),06N,NHS HERTS VALLEYS CCG,1
MSA-APRIL-2019,Q71,NHS ENGLAND LONDON,R1K,LONDON NORTH WEST UNIVERSITY HEALTHCARE NHS TRUST,R1K01,Northwick Park Hospital - R1K01,Q71,NHS ENGLAND LONDON,07P,NHS BRENT CCG,10
MSA-APRIL-2019,Q71,NHS ENGLAND LONDON,R1K,LONDON NORTH WEST UNIVERSITY HEALTHCARE NHS TRUST,R1K01,Northwick Park Hospital - R1K01,Q71,NHS ENGLAND LONDON,07W,NHS EALING CCG,5
MSA-APRIL-2019,Q71,NHS ENGLAND LONDON,R1K,LONDON NORTH WEST UNIVERSITY HEALTHCARE NHS TRUST,R1K01,Northwick Park Hospital - R1K01,Q71,NHS ENGLAND LONDON,07Y,NHS HOUNSLOW CCG,1
MSA-APRIL-2019,Q71,NHS ENGLAND LONDON,R1K,LONDON NORTH WEST UNIVERSITY HEALTHCARE NHS TRUST,R1K01,Northwick Park Hospital - R1K01,Q71,NHS ENGLAND LONDON,08E,NHS HARROW CCG,15
MSA-APRIL-2019,Q71,NHS ENGLAND LONDON,R1K,LONDON NORTH WEST UNIVERSITY HEALTHCARE NHS TRUST,R1K01,Northwick Park Hospital - R1K01,Q71,NHS ENGLAND LONDON,08G,NHS HILLINGDON CCG,2
MSA-APRIL-2019,Q71,NHS ENGLAND LONDON,R1K,LONDON NORTH WEST UNIVERSITY HEALTHCARE NHS TRUST,R1K01,Northwick Park Hospital - R1K01,Q85,NHS ENGLAND SOUTH WEST (SOUTH WEST SOUTH),11X,NHS SOMERSET CCG,1
MSA-APRIL-2019,Q71,NHS ENGLAND LONDON,R1K,LONDON NORTH WEST UNIVERSITY HEALTHCARE NHS TRUST,R1K01,Northwick Park Hospital - R1K01,Q87,"NHS ENGLAND SOUTH EAST (HAMPSHIRE, ISLE OF WIGHT AND THAMES VALLEY)",14Y,NHS BUCKINGHAMSHIRE CCG,1
MSA-APRIL-2019,Q79,NHS ENGLAND MIDLANDS AND EAST (EAST),R1L,ESSEX PARTNERSHIP UNIVERSITY NHS FOUNDATION TRUST,NULL,,,,NILRETURN,,0
MSA-APRIL-2019,Q88,"NHS ENGLAND SOUTH EAST (KENT, SURREY AND SUSSEX)",RA2,ROYAL SURREY COUNTY HOSPITAL NHS FOUNDATION TRUST,NULL,,,,NILRETURN,,0
MSA-APRIL-2019,Q86,NHS ENGLAND SOUTH WEST (SOUTH WEST NORTH),RA3,WESTON AREA HEALTH NHS TRUST,NULL,,,,NILRETURN,,0
MSA-APRIL-2019,Q85,NHS ENGLAND SOUTH WEST (SOUTH WEST SOUTH),RA4,YEOVIL DISTRICT HOSPITAL NHS FOUNDATION TRUST,NULL,,,,NILRETURN,,0
MSA-APRIL-2019,Q86,NHS ENGLAND SOUTH WEST (SOUTH WEST NORTH),RA7,UNIVERSITY HOSPITALS BRISTOL NHS FOUNDATION TRUST,NULL,,,,NILRETURN,,0
MSA-APRIL-2019,Q85,NHS ENGLAND SOUTH WEST (SOUTH WEST SOUTH),RA9,TORBAY AND SOUTH DEVON NHS FOUNDATION TRUST,NULL,,,,NILRETURN,,0
MSA-APRIL-2019,Q72,NHS ENGLAND NORTH (YORKSHIRE AND HUMBER),RAE,BRADFORD TEACHING HOSPITALS NHS FOUNDATION TRUST,NULL,,,,NILRETURN,,0
MSA-APRIL-2019,Q79,NHS ENGLAND MIDLANDS AND EAST (EAST),RAJ,SOUTHEND UNIVERSITY HOSPITAL NHS FOUNDATION TRUST,NULL,,,,NILRETURN,,0
MSA-APRIL-2019,Q71,NHS ENGLAND LONDON,RAL,ROYAL FREE LONDON NHS FOUNDATION TRUST,RAL26,Barnet Hospital - RAL26,Q79,NHS ENGLAND MIDLANDS AND EAST (EAST),06K,NHS EAST AND NORTH HERTFORDSHIRE CCG,2
MSA-APRIL-2019,Q71,NHS ENGLAND LONDON,RAL,ROYAL FREE LONDON NHS FOUNDATION TRUST,RAL26,Barnet Hospital - RAL26,Q79,NHS ENGLAND MIDLANDS AND EAST (EAST),06N,NHS HERTS VALLEYS CCG,17
MSA-APRIL-2019,Q71,NHS ENGLAND LONDON,RAL,ROYAL FREE LONDON NHS FOUNDATION TRUST,RAL26,Barnet Hospital - RAL26,Q71,NHS ENGLAND LONDON,07M,NHS BARNET CCG,18
MSA-APRIL-2019,Q71,NHS ENGLAND LONDON,RAL,ROYAL FREE LONDON NHS FOUNDATION TRUST,RAL01,Royal Free Hospital - RAL01,Q71,NHS ENGLAND LONDON,07M,NHS BARNET CCG,1
MSA-APRIL-2019,Q71,NHS ENGLAND LONDON,RAL,ROYAL FREE LONDON NHS FOUNDATION TRUST,RAL26,Barnet Hospital - RAL26,Q71,NHS ENGLAND LONDON,07P,NHS BRENT CCG,1
MSA-APRIL-2019,Q71,NHS ENGLAND LONDON,RAL,ROYAL FREE LONDON NHS FOUNDATION TRUST,RAL01,Royal Free Hospital - RAL01,Q71,NHS ENGLAND LONDON,07T,NHS CITY AND HACKNEY CCG,1
MSA-APRIL-2019,Q71,NHS ENGLAND LONDON,RAL,ROYAL FREE LONDON NHS FOUNDATION TRUST,RAL26,Barnet Hospital - RAL26,Q71,NHS ENGLAND LONDON,07X,NHS ENFIELD CCG,6
MSA-APRIL-2019,Q71,NHS ENGLAND LONDON,RAL,ROYAL FREE LONDON NHS FOUNDATION TRUST,RAL01,Royal Free Hospital - RAL01,Q71,NHS ENGLAND LONDON,08D,NHS HARINGEY CCG,1
MSA-APRIL-2019,Q71,NHS ENGLAND LONDON,RAL,ROYAL FREE LONDON NHS FOUNDATION TRUST,RAL26,Barnet Hospital - RAL26,Q71,NHS ENGLAND LONDON,08D,NHS HARINGEY CCG,1
MSA-APRIL-2019,Q71,NHS ENGLAND LONDON,RAL,ROYAL FREE LONDON NHS FOUNDATION TRUST,RAL26,Barnet Hospital - RAL26,Q71,NHS ENGLAND LONDON,08E,NHS HARROW CCG,1
MSA-APRIL-2019,Q71,NHS ENGLAND LONDON,RAL,ROYAL FREE LONDON NHS FOUNDATION TRUST,RAL01,Royal Free Hospital - RAL01,Q71,NHS ENGLAND LONDON,08M,NHS NEWHAM CCG,1
MSA-APRIL-2019,Q71,NHS ENGLAND LONDON,RAL,ROYAL FREE LONDON NHS FOUNDATION TRUST,RAL01,Royal Free Hospital - RAL01,,,X24,NHS ENGLAND,1
MSA-APRIL-2019,Q71,NHS ENGLAND LONDON,RAN,ROYAL NATIONAL ORTHOPAEDIC HOSPITAL NHS TRUST,RAN01,The Royal National Orthopaedic Hospital (Stanmore) - RAN01,Q79,NHS ENGLAND MIDLANDS AND EAST (EAST),04F,NHS MILTON KEYNES CCG,1
MSA-APRIL-2019,Q71,NHS ENGLAND LONDON,RAN,ROYAL NATIONAL ORTHOPAEDIC HOSPITAL NHS TRUST,RAN01,The Royal National Orthopaedic Hospital (Stanmore) - RAN01,Q79,NHS ENGLAND MIDLANDS AND EAST (EAST),06Q,NHS MID ESSEX CCG,1
MSA-APRIL-2019,Q71,NHS ENGLAND LONDON,RAN,ROYAL NATIONAL ORTHOPAEDIC HOSPITAL NHS TRUST,RAN01,The Royal National Orthopaedic Hospital (Stanmore) - RAN01,Q79,NHS ENGLAND MIDLANDS AND EAST (EAST),06V,NHS NORTH NORFOLK CCG,1
MSA-APRIL-2019,Q71,NHS ENGLAND LONDON,RAN,ROYAL NATIONAL ORTHOPAEDIC HOSPITAL NHS TRUST,RAN01,The Royal National Orthopaedic Hospital (Stanmore) - RAN01,Q79,NHS ENGLAND MIDLANDS AND EAST (EAST),06W,NHS NORWICH CCG,1
MSA-APRIL-2019,Q71,NHS ENGLAND LONDON,RAN,ROYAL NATIONAL ORTHOPAEDIC HOSPITAL NHS TRUST,RAN01,The Royal National Orthopaedic Hospital (Stanmore) - RAN01,Q71,NHS ENGLAND LONDON,07M,NHS BARNET CCG,1
MSA-APRIL-2019,Q71,NHS ENGLAND LONDON,RAN,ROYAL NATIONAL ORTHOPAEDIC HOSPITAL NHS TRUST,RAN01,The Royal National Orthopaedic Hospital (Stanmore) - RAN01,Q88,"NHS ENGLAND SOUTH EAST (KENT, SURREY AND SUSSEX)",09H,NHS CRAWLEY CCG,1
MSA-APRIL-2019,Q71,NHS ENGLAND LONDON,RAN,ROYAL NATIONAL ORTHOPAEDIC HOSPITAL NHS TRUST,RAN01,The Royal National Orthopaedic Hospital (Stanmore) - RAN01,Q87,"NHS ENGLAND SOUTH EAST (HAMPSHIRE, ISLE OF WIGHT AND THAMES VALLEY)",10C,NHS SURREY HEATH CCG,1
MSA-APRIL-2019,Q71,NHS ENGLAND LONDON,RAP,NORTH MIDDLESEX UNIVERSITY HOSPITAL NHS TRUST,NULL,,,,NILRETURN,,0
MSA-APRIL-2019,Q71,NHS ENGLAND LONDON,RAS,THE HILLINGDON HOSPITALS NHS FOUNDATION TRUST,RAS01,Hillingdon Hospital - RAS01,Q71,NHS ENGLAND LONDON,07W,NHS EALING CCG,3
MSA-APRIL-2019,Q71,NHS ENGLAND LONDON,RAS,THE HILLINGDON HOSPITALS NHS FOUNDATION TRUST,RAS01,Hillingdon Hospital - RAS01,Q71,NHS ENGLAND LONDON,08E,NHS HARROW CCG,2
MSA-APRIL-2019,Q71,NHS ENGLAND LONDON,RAS,THE HILLINGDON HOSPITALS NHS FOUNDATION TRUST,RAS01,Hillingdon Hospital - RAS01,Q71,NHS ENGLAND LONDON,08G,NHS HILLINGDON CCG,12
MSA-APRIL-2019,Q71,NHS ENGLAND LONDON,RAS,THE HILLINGDON HOSPITALS NHS FOUNDATION TRUST,RAS01,Hillingdon Hospital - RAS01,,,NONC,,1
MSA-APRIL-2019,Q71,NHS ENGLAND LONDON,RAS,THE HILLINGDON HOSPITALS NHS FOUNDATION TRUST,RAS01,Hillingdon Hospital - RAS01,,,X24,NHS ENGLAND,1
MSA-APRIL-2019,Q71,NHS ENGLAND LONDON,RAT,NORTH EAST LONDON NHS FOUNDATION TRUST,NULL,,,,NILRETURN,,0
MSA-APRIL-2019,Q71,NHS ENGLAND LONDON,RAX,KINGSTON HOSPITAL NHS FOUNDATION TRUST,NULL,,,,NILRETURN,,0
MSA-APRIL-2019,Q85,NHS ENGLAND SOUTH WEST (SOUTH WEST SOUTH),RBA,TAUNTON AND SOMERSET NHS FOUNDATION TRUST,NULL,,,,NILRETURN,,0
MSA-APRIL-2019,Q85,NHS ENGLAND SOUTH WEST (SOUTH WEST SOUTH),RBD,DORSET COUNTY HOSPITAL NHS FOUNDATION TRUST,RBD01,Dorset County Hospital - RBD01,Q85,NHS ENGLAND SOUTH WEST (SOUTH WEST SOUTH),11J,NHS DORSET CCG,10
MSA-APRIL-2019,Q77,NHS ENGLAND MIDLANDS AND EAST (WEST MIDLANDS),RBK,WALSALL HEALTHCARE NHS TRUST,NULL,,,,NILRETURN,,0
MSA-APRIL-2019,Q75,NHS ENGLAND NORTH (CHESHIRE AND MERSEYSIDE),RBL,WIRRAL UNIVERSITY TEACHING HOSPITAL NHS FOUNDATION TRUST,RBL14,Arrowe Park Hospital - RBL14,Q75,NHS ENGLAND NORTH (CHESHIRE AND MERSEYSIDE),12F,NHS WIRRAL CCG,13
MSA-APRIL-2019,Q75,NHS ENGLAND NORTH (CHESHIRE AND MERSEYSIDE),RBN,ST HELENS AND KNOWSLEY TEACHING HOSPITALS NHS TRUST,NULL,,,,NILRETURN,,0
MSA-APRIL-2019,Q75,NHS ENGLAND NORTH (CHESHIRE AND MERSEYSIDE),RBQ,LIVERPOOL HEART AND CHEST HOSPITAL NHS FOUNDATION TRUST,NULL,,,,NILRETURN,,0
MSA-APRIL-2019,Q75,NHS ENGLAND NORTH (CHESHIRE AND MERSEYSIDE),RBS,ALDER HEY CHILDREN'S NHS FOUNDATION TRUST,NULL,,,,NILRETURN,,0
MSA-APRIL-2019,Q75,NHS ENGLAND NORTH (CHESHIRE AND MERSEYSIDE),RBT,MID CHESHIRE HOSPITALS NHS FOUNDATION TRUST,NULL,,,,NILRETURN,,0
MSA-APRIL-2019,Q83,NHS ENGLAND NORTH (GREATER MANCHESTER),RBV,THE CHRISTIE NHS FOUNDATION TRUST,RBV01,The Christie - RBV01,,,X24,NHS ENGLAND,3
MSA-APRIL-2019,Q85,NHS ENGLAND SOUTH WEST (SOUTH WEST SOUTH),RBZ,NORTHERN DEVON HEALTHCARE NHS TRUST,NULL,,,,NILRETURN,,0
MSA-APRIL-2019,Q79,NHS ENGLAND MIDLANDS AND EAST (EAST),RC1,BEDFORD HOSPITAL NHS TRUST,RC110,Bedford Hospital South Wing - RC110,Q79,NHS ENGLAND MIDLANDS AND EAST (EAST),06F,NHS BEDFORDSHIRE CCG,26
MSA-APRIL-2019,Q79,NHS ENGLAND MIDLANDS AND EAST (EAST),RC9,LUTON AND DUNSTABLE UNIVERSITY HOSPITAL NHS FOUNDATION TRUST,RC971,Luton and Dunstable Hospital - RC971,Q79,NHS ENGLAND MIDLANDS AND EAST (EAST),06N,NHS HERTS VALLEYS CCG,2
MSA-APRIL-2019,Q72,NHS ENGLAND NORTH (YORKSHIRE AND HUMBER),RCB,YORK TEACHING HOSPITAL NHS FOUNDATION TRUST,NULL,,,,NILRETURN,,0
MSA-APRIL-2019,Q72,NHS ENGLAND NORTH (YORKSHIRE AND HUMBER),RCD,HARROGATE AND DISTRICT NHS FOUNDATION TRUST,NULL,,,,NILRETURN,,0
MSA-APRIL-2019,Q72,NHS ENGLAND NORTH (YORKSHIRE AND HUMBER),RCF,AIREDALE NHS FOUNDATION TRUST,RCF22,Airedale General Hospital - RCF22,Q72,NHS ENGLAND NORTH (YORKSHIRE AND HUMBER),02N,"NHS AIREDALE, WHARFEDALE AND CRAVEN CCG",1
MSA-APRIL-2019,Q72,NHS ENGLAND NORTH (YORKSHIRE AND HUMBER),RCU,SHEFFIELD CHILDREN'S NHS FOUNDATION TRUST,NULL,,,,NILRETURN,,0
MSA-APRIL-2019,Q79,NHS ENGLAND MIDLANDS AND EAST (EAST),RCX,"THE QUEEN ELIZABETH HOSPITAL, KING'S LYNN, NHS FOUNDATION TRUST",RCX70,The Queen Elizabeth Hospital - RCX70,Q79,NHS ENGLAND MIDLANDS AND EAST (EAST),07J,NHS WEST NORFOLK CCG,6
MSA-APRIL-2019,Q86,NHS ENGLAND SOUTH WEST (SOUTH WEST NORTH),RD1,ROYAL UNITED HOSPITALS BATH NHS FOUNDATION TRUST,NULL,,,,NILRETURN,,0
MSA-APRIL-2019,Q85,NHS ENGLAND SOUTH WEST (SOUTH WEST SOUTH),RD3,POOLE HOSPITAL NHS FOUNDATION TRUST,NULL,,,,NILRETURN,,0
MSA-APRIL-2019,Q79,NHS ENGLAND MIDLANDS AND EAST (EAST),RD8,MILTON KEYNES UNIVERSITY HOSPITAL NHS FOUNDATION TRUST,NULL,,,,NILRETURN,,0
MSA-APRIL-2019,Q79,NHS ENGLAND MIDLANDS AND EAST (EAST),RDD,BASILDON AND THURROCK UNIVERSITY HOSPITALS NHS FOUNDATION TRUST,NULL,,,,NILRETURN,,0
MSA-APRIL-2019,Q79,NHS ENGLAND MIDLANDS AND EAST (EAST),RDE,EAST SUFFOLK AND NORTH ESSEX NHS FOUNDATION TRUST,NULL,,,,NILRETURN,,0
MSA-APRIL-2019,Q88,"NHS ENGLAND SOUTH EAST (KENT, SURREY AND SUSSEX)",RDR,SUSSEX COMMUNITY NHS FOUNDATION TRUST,NULL,,,,NILRETURN,,0
MSA-APRIL-2019,Q87,"NHS ENGLAND SOUTH EAST (HAMPSHIRE, ISLE OF WIGHT AND THAMES VALLEY)",RDU,FRIMLEY HEALTH NHS FOUNDATION TRUST,RDU01,Frimley Park Hospital - RDU01,Q74,NHS ENGLAND NORTH (CUMBRIA AND NORTH EAST),00D,"NHS DURHAM DALES, EASINGTON AND SEDGEFIELD CCG",1
MSA-APRIL-2019,Q87,"NHS ENGLAND SOUTH EAST (HAMPSHIRE, ISLE OF WIGHT AND THAMES VALLEY)",RDU,FRIMLEY HEALTH NHS FOUNDATION TRUST,RDU50,Wexham Park Hospital - RDU50,Q72,NHS ENGLAND NORTH (YORKSHIRE AND HUMBER),03E,NHS HARROGATE AND RURAL DISTRICT CCG,1
MSA-APRIL-2019,Q87,"NHS ENGLAND SOUTH EAST (HAMPSHIRE, ISLE OF WIGHT AND THAMES VALLEY)",RDU,FRIMLEY HEALTH NHS FOUNDATION TRUST,RDU50,Wexham Park Hospital - RDU50,Q79,NHS ENGLAND MIDLANDS AND EAST (EAST),06N,NHS HERTS VALLEYS CCG,1
MSA-APRIL-2019,Q87,"NHS ENGLAND SOUTH EAST (HAMPSHIRE, ISLE OF WIGHT AND THAMES VALLEY)",RDU,FRIMLEY HEALTH NHS FOUNDATION TRUST,RDU50,Wexham Park Hospital - RDU50,Q71,NHS ENGLAND LONDON,08G,NHS HILLINGDON CCG,2
MSA-APRIL-2019,Q87,"NHS ENGLAND SOUTH EAST (HAMPSHIRE, ISLE OF WIGHT AND THAMES VALLEY)",RDU,FRIMLEY HEALTH NHS FOUNDATION TRUST,RDU50,Wexham Park Hospital - RDU50,Q71,NHS ENGLAND LONDON,08X,NHS WANDSWORTH CCG,1
MSA-APRIL-2019,Q87,"NHS ENGLAND SOUTH EAST (HAMPSHIRE, ISLE OF WIGHT AND THAMES VALLEY)",RDU,FRIMLEY HEALTH NHS FOUNDATION TRUST,RDU01,Frimley Park Hospital - RDU01,Q88,"NHS ENGLAND SOUTH EAST (KENT, SURREY AND SUSSEX)",09N,NHS GUILDFORD AND WAVERLEY CCG,3
MSA-APRIL-2019,Q87,"NHS ENGLAND SOUTH EAST (HAMPSHIRE, ISLE OF WIGHT AND THAMES VALLEY)",RDU,FRIMLEY HEALTH NHS FOUNDATION TRUST,RDU01,Frimley Park Hospital - RDU01,Q88,"NHS ENGLAND SOUTH EAST (KENT, SURREY AND SUSSEX)",09Y,NHS NORTH WEST SURREY CCG,1
MSA-APRIL-2019,Q87,"NHS ENGLAND SOUTH EAST (HAMPSHIRE, ISLE OF WIGHT AND THAMES VALLEY)",RDU,FRIMLEY HEALTH NHS FOUNDATION TRUST,RDU01,Frimley Park Hospital - RDU01,Q87,"NHS ENGLAND SOUTH EAST (HAMPSHIRE, ISLE OF WIGHT AND THAMES VALLEY)",10C,NHS SURREY HEATH CCG,16
MSA-APRIL-2019,Q87,"NHS ENGLAND SOUTH EAST (HAMPSHIRE, ISLE OF WIGHT AND THAMES VALLEY)",RDU,FRIMLEY HEALTH NHS FOUNDATION TRUST,RDU01,Frimley Park Hospital - RDU01,Q87,"NHS ENGLAND SOUTH EAST (HAMPSHIRE, ISLE OF WIGHT AND THAMES VALLEY)",10J,NHS NORTH HAMPSHIRE CCG,1
MSA-APRIL-2019,Q87,"NHS ENGLAND SOUTH EAST (HAMPSHIRE, ISLE OF WIGHT AND THAMES VALLEY)",RDU,FRIMLEY HEALTH NHS FOUNDATION TRUST,RDU01,Frimley Park Hospital - RDU01,Q87,"NHS ENGLAND SOUTH EAST (HAMPSHIRE, ISLE OF WIGHT AND THAMES VALLEY)",10V,NHS SOUTH EASTERN HAMPSHIRE CCG,1
MSA-APRIL-2019,Q87,"NHS ENGLAND SOUTH EAST (HAMPSHIRE, ISLE OF WIGHT AND THAMES VALLEY)",RDU,FRIMLEY HEALTH NHS FOUNDATION TRUST,RDU01,Frimley Park Hospital - RDU01,Q87,"NHS ENGLAND SOUTH EAST (HAMPSHIRE, ISLE OF WIGHT AND THAMES VALLEY)",11A,NHS WEST HAMPSHIRE CCG,2
MSA-APRIL-2019,Q87,"NHS ENGLAND SOUTH EAST (HAMPSHIRE, ISLE OF WIGHT AND THAMES VALLEY)",RDU,FRIMLEY HEALTH NHS FOUNDATION TRUST,RDU50,Wexham Park Hospital - RDU50,Q87,"NHS ENGLAND SOUTH EAST (HAMPSHIRE, ISLE OF WIGHT AND THAMES VALLEY)",14Y,NHS BUCKINGHAMSHIRE CCG,15
MSA-APRIL-2019,Q87,"NHS ENGLAND SOUTH EAST (HAMPSHIRE, ISLE OF WIGHT AND THAMES VALLEY)",RDU,FRIMLEY HEALTH NHS FOUNDATION TRUST,RDU01,Frimley Park Hospital - RDU01,Q87,"NHS ENGLAND SOUTH EAST (HAMPSHIRE, ISLE OF WIGHT AND THAMES VALLEY)",15A,NHS BERKSHIRE WEST CCG,2
MSA-APRIL-2019,Q87,"NHS ENGLAND SOUTH EAST (HAMPSHIRE, ISLE OF WIGHT AND THAMES VALLEY)",RDU,FRIMLEY HEALTH NHS FOUNDATION TRUST,RDU01,Frimley Park Hospital - RDU01,Q87,"NHS ENGLAND SOUTH EAST (HAMPSHIRE, ISLE OF WIGHT AND THAMES VALLEY)",15D,NHS EAST BERKSHIRE CCG,5
MSA-APRIL-2019,Q87,"NHS ENGLAND SOUTH EAST (HAMPSHIRE, ISLE OF WIGHT AND THAMES VALLEY)",RDU,FRIMLEY HEALTH NHS FOUNDATION TRUST,RDU50,Wexham Park Hospital - RDU50,Q87,"NHS ENGLAND SOUTH EAST (HAMPSHIRE, ISLE OF WIGHT AND THAMES VALLEY)",15D,NHS EAST BERKSHIRE CCG,42
MSA-APRIL-2019,Q87,"NHS ENGLAND SOUTH EAST (HAMPSHIRE, ISLE OF WIGHT AND THAMES VALLEY)",RDU,FRIMLEY HEALTH NHS FOUNDATION TRUST,RDU01,Frimley Park Hospital - RDU01,Q87,"NHS ENGLAND SOUTH EAST (HAMPSHIRE, ISLE OF WIGHT AND THAMES VALLEY)",99M,NHS NORTH EAST HAMPSHIRE AND FARNHAM CCG,25
MSA-APRIL-2019,Q87,"NHS ENGLAND SOUTH EAST (HAMPSHIRE, ISLE OF WIGHT AND THAMES VALLEY)",RDU,FRIMLEY HEALTH NHS FOUNDATION TRUST,RDU50,Wexham Park Hospital - RDU50,Q87,"NHS ENGLAND SOUTH EAST (HAMPSHIRE, ISLE OF WIGHT AND THAMES VALLEY)",99M,NHS NORTH EAST HAMPSHIRE AND FARNHAM CCG,1
MSA-APRIL-2019,Q87,"NHS ENGLAND SOUTH EAST (HAMPSHIRE, ISLE OF WIGHT AND THAMES VALLEY)",RDU,FRIMLEY HEALTH NHS FOUNDATION TRUST,RDU01,Frimley Park Hospital - RDU01,Q86,NHS ENGLAND SOUTH WEST (SOUTH WEST NORTH),99N,NHS WILTSHIRE CCG,1
MSA-APRIL-2019,Q85,NHS ENGLAND SOUTH WEST (SOUTH WEST SOUTH),RDY,DORSET HEALTHCARE UNIVERSITY NHS FOUNDATION TRUST,NULL,,,,NILRETURN,,0
MSA-APRIL-2019,Q85,NHS ENGLAND SOUTH WEST (SOUTH WEST SOUTH),RDZ,THE ROYAL BOURNEMOUTH AND CHRISTCHURCH HOSPITALS NHS FOUNDATION TRUST,RDZ20,Royal Bournemouth General Hospital - RDZ20,Q87,"NHS ENGLAND SOUTH EAST (HAMPSHIRE, ISLE OF WIGHT AND THAMES VALLEY)",11A,NHS WEST HAMPSHIRE CCG,2
MSA-APRIL-2019,Q85,NHS ENGLAND SOUTH WEST (SOUTH WEST SOUTH),RDZ,THE ROYAL BOURNEMOUTH AND CHRISTCHURCH HOSPITALS NHS FOUNDATION TRUST,RDZ20,Royal Bournemouth General Hospital - RDZ20,Q85,NHS ENGLAND SOUTH WEST (SOUTH WEST SOUTH),11J,NHS DORSET CCG,8
MSA-APRIL-2019,Q85,NHS ENGLAND SOUTH WEST (SOUTH WEST SOUTH),REF,ROYAL CORNWALL HOSPITALS NHS TRUST,NULL,,,,NILRETURN,,0
MSA-APRIL-2019,Q75,NHS ENGLAND NORTH (CHESHIRE AND MERSEYSIDE),REM,AINTREE UNIVERSITY HOSPITAL NHS FOUNDATION TRUST,NULL,,,,NILRETURN,,0
MSA-APRIL-2019,Q75,NHS ENGLAND NORTH (CHESHIRE AND MERSEYSIDE),REN,THE CLATTERBRIDGE CANCER CENTRE NHS FOUNDATION TRUST,NULL,,,,NILRETURN,,0
MSA-APRIL-2019,Q75,NHS ENGLAND NORTH (CHESHIRE AND MERSEYSIDE),REP,LIVERPOOL WOMEN'S NHS FOUNDATION TRUST,NULL,,,,NILRETURN,,0
MSA-APRIL-2019,Q75,NHS ENGLAND NORTH (CHESHIRE AND MERSEYSIDE),RET,THE WALTON CENTRE NHS FOUNDATION TRUST,NULL,,,,NILRETURN,,0
MSA-APRIL-2019,Q71,NHS ENGLAND LONDON,RF4,"BARKING, HAVERING AND REDBRIDGE UNIVERSITY HOSPITALS NHS TRUST",RF4QH,Queen's Hospital - RF4QH,Q71,NHS ENGLAND LONDON,07L,NHS BARKING AND DAGENHAM CCG,1
MSA-APRIL-2019,Q71,NHS ENGLAND LONDON,RF4,"BARKING, HAVERING AND REDBRIDGE UNIVERSITY HOSPITALS NHS TRUST",RF4QH,Queen's Hospital - RF4QH,Q71,NHS ENGLAND LONDON,08F,NHS HAVERING CCG,3
MSA-APRIL-2019,Q72,NHS ENGLAND NORTH (YORKSHIRE AND HUMBER),RFF,BARNSLEY HOSPITAL NHS FOUNDATION TRUST,NULL,,,,NILRETURN,,0
MSA-APRIL-2019,Q72,NHS ENGLAND NORTH (YORKSHIRE AND HUMBER),RFR,THE ROTHERHAM NHS FOUNDATION TRUST,NULL,,,,NILRETURN,,0
MSA-APRIL-2019,Q76,NHS ENGLAND MIDLANDS AND EAST (NORTH MIDLANDS),RFS,CHESTERFIELD ROYAL HOSPITAL NHS FOUNDATION TRUST,NULL,,,,NILRETURN,,0
MSA-APRIL-2019,Q72,NHS ENGLAND NORTH (YORKSHIRE AND HUMBER),RGD,LEEDS AND YORK PARTNERSHIP NHS FOUNDATION TRUST,NULL,,,,NILRETURN,,0
MSA-APRIL-2019,Q79,NHS ENGLAND MIDLANDS AND EAST (EAST),RGM,ROYAL PAPWORTH HOSPITAL NHS FOUNDATION TRUST,NULL,,,,NILRETURN,,0
MSA-APRIL-2019,Q79,NHS ENGLAND MIDLANDS AND EAST (EAST),RGN,NORTH WEST ANGLIA NHS FOUNDATION TRUST,NULL,,,,NILRETURN,,0
MSA-APRIL-2019,Q79,NHS ENGLAND MIDLANDS AND EAST (EAST),RGP,JAMES PAGET UNIVERSITY HOSPITALS NHS FOUNDATION TRUST,NULL,,,,NILRETURN,,0
MSA-APRIL-2019,Q79,NHS ENGLAND MIDLANDS AND EAST (EAST),RGR,WEST SUFFOLK NHS FOUNDATION TRUST,NULL,,,,NILRETURN,,0
MSA-APRIL-2019,Q79,NHS ENGLAND MIDLANDS AND EAST (EAST),RGT,CAMBRIDGE UNIVERSITY HOSPITALS NHS FOUNDATION TRUST,RGT01,Addenbrooke's Hospital - RGT01,Q79,NHS ENGLAND MIDLANDS AND EAST (EAST),06H,NHS CAMBRIDGESHIRE AND PETERBOROUGH CCG,1
MSA-APRIL-2019,Q85,NHS ENGLAND SOUTH WEST (SOUTH WEST SOUTH),RH5,SOMERSET PARTNERSHIP NHS FOUNDATION TRUST,NULL,,,,NILRETURN,,0
MSA-APRIL-2019,Q85,NHS ENGLAND SOUTH WEST (SOUTH WEST SOUTH),RH8,ROYAL DEVON AND EXETER NHS FOUNDATION TRUST,NULL,,,,NILRETURN,,0
MSA-APRIL-2019,Q76,NHS ENGLAND MIDLANDS AND EAST (NORTH MIDLANDS),RHA,NOTTINGHAMSHIRE HEALTHCARE NHS FOUNDATION TRUST,NULL,,,,NILRETURN,,0
MSA-APRIL-2019,Q87,"NHS ENGLAND SOUTH EAST (HAMPSHIRE, ISLE OF WIGHT AND THAMES VALLEY)",RHM,UNIVERSITY HOSPITAL SOUTHAMPTON NHS FOUNDATION TRUST,RHM01,Southampton General Hospital - RHM01,Q88,"NHS ENGLAND SOUTH EAST (KENT, SURREY AND SUSSEX)",09G,NHS COASTAL WEST SUSSEX CCG,1