{"text_format":"1","workbook":"xlsx","n_sheets":5,"sheets":["Overview","FY 23-24","FY 24-25","Sheet1","Sheet2"],"not_rendered":{"charts":0,"images":0,"macros":1,"external_links":0,"defined_names":5,"comments":2,"pivot_tables":0},"unopened":[],"bounds":{"document_bytes":16777216,"sheet_cells":100000,"rows_first":2000,"rows_last":500,"rows_between":2000,"halvings":0,"cell_chars":16384,"cell_head_chars":4096},"cells_cut":0,"cells_raw":0,"read":"whole","date_system":"1900"}

{"sheet":"Overview","index":0,"n_rows":22,"n_cols":2,"rows_kept":22,"cut":false,"hidden":false,"merged":[[3,1,3,12],[6,1,6,12],[4,1,4,14]]}
[]
[null,"ECDS Activity & Performance"]
[]
[null,"This analysis is designed to support the Monthly A&E Attendances and Emergency Admissions publication, adding more context to the types of attendances seen each month. The Monthly Publication can be found on the link below:"]
[null,"https://www.england.nhs.uk/statistics/statistical-work-areas/ae-waiting-times-and-activity/"]
[]
[null,"Data presented here is 12hrs from arrival performance by month for the Financial Year, based on a subset of Type 1 & 2 A&E providers who have the required level of completion for the given month. The providers included in the cohorts and each breakdown may differ each month, but each has undergone checks to ensure they are representative of England activity as a whole.\n"]
[null,"Type 1 departments are major emergency departments that are consultant-led and open 24 hours a day. They deal with the most acute cases. "]
[null,"Type 2 departments are similar to Type 1 in that they are consultant-led, however they specialise in a single specialty, such as children or opthamology."]
[]
[null,"Contents"]
[null,"Financial Year: 2023 - 2024"]
[null,"Financial Year: 2024 - 2025"]
[]
[null,"For further information about these published statistics, please contact us at:"]
[]
[null,"Operational Insight (Urgent and Emergency Care)"]
[null,"NHS England"]
[null,"A6.08, Wellington Place"]
[null,"LEEDS LS1 4AP"]
{"$rows_left_out":3}
{"sheet":"FY 23-24","index":1,"n_rows":144,"n_cols":19,"rows_kept":144,"cut":false,"hidden":false,"merged":[[140,2,140,18],[141,2,141,18],[142,2,142,18]]}
[]
[null,null,"Title:","Proportion of Type 1 and 2 Attendances Where the Patient Spent Over 12 Hours in Department"]
[null,null,"Summary:","The proportion of Type 1 and 2 Attendances  where the patient spent over 12 hours in department by trust, for the financial year 2023/2024."]
[]
[null,null,"Period:","April 2023 to March 2024"]
[null,null,"Source:","ECDS - NHS England"]
[null,null,"Basis","Provider Type 1 & 2"]
[null,null,"Published:","15th May 2025"]
[null,null,"Data Extracted:","1st May 2025"]
[null,null,"Revised:","N/A"]
[null,null,"Status:","Published (Final) - Official Statistics in development"]
[null,null,"Contact:","Kerry Evert - england.aedata@nhs.net"]
[]
[null,null,"Provider Level Data"]
[]
[null,null,"Region","ICB","Org Code","Provider","2023-04-01","2023-05-01","2023-06-01","2023-07-01","2023-08-01","2023-09-01","2023-10-01","2023-11-01","2023-12-01","2024-01-01","2024-02-01","2024-03-01","2023/24"]
[null,null,"East of England","NHS Bedfordshire, Luton and Milton Keynes ICB","RC9","Bedfordshire Hospitals NHS Foundation Trust",2.4299999999999999E-2,3.5299999999999998E-2,4.2099999999999999E-2,2.92E-2,3.1300000000000001E-2,4.1700000000000001E-2,4.4499999999999998E-2,5.1900000000000002E-2,6.5600000000000006E-2,7.1199999999999999E-2,6.2E-2,5.6899999999999999E-2,4.6518420954798689E-2]
[null,null,"East of England","NHS Cambridgeshire and Peterborough ICB","RGT","Cambridge University Hospitals NHS Foundation Trust",0.1244,6.7000000000000004E-2,9.3799999999999994E-2,5.1200000000000002E-2,0.10390000000000001,7.7899999999999997E-2,0.14050000000000001,0.13020000000000001,0.14069999999999999,0.15870000000000001,0.16880000000000001,0.1226,0.11549605840361299]
[null,null,"East of England","NHS Hertfordshire and West Essex ICB","RWH","East and North Hertfordshire NHS Trust",0.1273,0.13800000000000001,0.13239999999999999,9.3399999999999997E-2,0.127,0.1241,0.13,0.1321,0.15090000000000001,0.15060000000000001,0.1394,0.1104,0.12973949839114912]
[null,null,"East of England","NHS Suffolk and North East Essex ICB","RDE","East Suffolk and North Essex NHS Foundation Trust",6.7299999999999999E-2,6.9400000000000003E-2,8.5500000000000007E-2,3.3000000000000002E-2,9.5100000000000004E-2,6.0499999999999998E-2,0.10050000000000001,9.5600000000000004E-2,9.9599999999999994E-2,0.1196,0.1275,8.6499999999999994E-2,8.6667605072081266E-2]
{"$rows_left_out":125}
{"sheet":"FY 24-25","index":2,"n_rows":145,"n_cols":19,"rows_kept":145,"cut":false,"hidden":false,"merged":[[139,2,139,14],[140,2,140,14]]}
[]
[null,null,"Title:","Proportion of Type 1 and 2 Attendances Where the Patient Spent Over 12 Hours in Department"]
[null,null,"Summary:","The proportion of Type 1 and 2 Attendances  where the patient spent over 12 hours in department by trust, for the financial year 2024/25."]
[]
[null,null,"Period:","April 2024 to March 2025"]
[null,null,"Source:","ECDS - NHS England"]
[null,null,"Basis:","Provider Type 1 & 2"]
[null,null,"Published:","15th May 2025"]
[null,null,"Data Extracted:","1st May 2025"]
[null,null,"Revised:","N/A"]
[null,null,"Status:","Published (Final) - Official Statistics in development"]
[null,null,"Contact:","Kerry Evert - england.aedata@nhs.net"]
[]
[null,null,"Provider Level Data"]
[]
[null,null,"Region","ICB","Org Code","Provider","2024-04-01","2024-05-01","2024-06-01","2024-07-01","2024-08-01","2024-09-01","2024-10-01","2024-11-01","2024-12-01","2025-01-01","2025-02-01","2025-03-01","2024/25"]
[null,null,"East of England","NHS Bedfordshire, Luton and Milton Keynes ICB","RC9","Bedfordshire Hospitals NHS Foundation Trust",6.8599999999999994E-2,6.0100000000000001E-2,4.2299999999999997E-2,4.1599999999999998E-2,3.39E-2,4.2999999999999997E-2,6.7500000000000004E-2,5.1299999999999998E-2,7.8299999999999995E-2,8.9899999999999994E-2,5.9299999999999999E-2,6.1100000000000002E-2,5.8038149943897138E-2]
[null,null,"East of England","NHS Cambridgeshire and Peterborough ICB","RGT","Cambridge University Hospitals NHS Foundation Trust",0.1454,0.13220000000000001,0.12939999999999999,0.1207,7.8700000000000006E-2,0.1114,0.12889999999999999,0.1171,0.12970000000000001,0.13489999999999999,0.1363,0.1012,0.12208790952184506]
[null,null,"East of England","NHS Hertfordshire and West Essex ICB","RWH","East and North Hertfordshire NHS Trust",0.1313,0.1409,8.7400000000000005E-2,9.2799999999999994E-2,9.01E-2,9.1800000000000007E-2,0.1469,0.1305,0.17019999999999999,0.17230000000000001,0.16339999999999999,0.1178,0.12790783888487275]
[null,null,"East of England","NHS Suffolk and North East Essex ICB","RDE","East Suffolk and North Essex NHS Foundation Trust",8.2000000000000003E-2,9.9400000000000002E-2,9.7000000000000003E-2,8.1900000000000001E-2,5.9299999999999999E-2,9.7699999999999995E-2,0.13589999999999999,0.13270000000000001,0.16930000000000001,0.16900000000000001,0.1608,0.1323,0.11719030468668573]
{"$rows_left_out":126}
{"sheet":"Sheet1","index":3,"n_rows":123,"n_cols":14,"rows_kept":123,"cut":false,"hidden":true,"merged":[[0,3,0,4],[0,6,0,7]]}
[null,null,null,"Live",null,null,"Published"]
[null,"Org Code","Provider","FYEAR 23/24","FYEAR24/25","Diff",null,null,null,"Top 10 Most Improved_Live","Top 10 Most Improved_Published","Lowest Perf_Live","Lowest Perf_Published","DQ"]
[null,"RK5",{"$f":"VLOOKUP(B3,#REF!,4,FALSE)","v":{"$error":"#REF!"}},{"$f":"VLOOKUP(B3,'FY 23-24'!$E$16:$S$137,15,FALSE)","v":4.7224121960298841E-2},{"$f":"VLOOKUP(B3,'FY 24-25'!$E$16:$S$135,15,FALSE)","v":5.1632158846184779E-2},{"$f":"E3-D3","v":4.4080368858859381E-3},4.9276695803302149E-2,5.7458791918565594E-2,{"$f":"H3-G3","v":8.1820961152634444E-3},{"$f":"RANK(F3,$F$3:$F$123,1)","v":{"$error":"#N/A"}},{"$f":"RANK(I3,$I$3:$I$123,1)","v":66},{"$f":"RANK(E3,$E$3:$E$123,2)","v":{"$error":"#N/A"}},{"$f":"RANK(H3,$H$3:$H$123,2)","v":30},{"$f":"IF(E3<D3,1,0)","v":0}]
[null,"RXQ",{"$f":"VLOOKUP(B4,#REF!,4,FALSE)","v":{"$error":"#REF!"}},{"$f":"VLOOKUP(B4,'FY 23-24'!$E$16:$S$137,15,FALSE)","v":0.14860082245561748},{"$f":"VLOOKUP(B4,'FY 24-25'!$E$16:$S$135,15,FALSE)","v":7.4060278488837464E-2},-7.4540543966780018E-2,0.1138812592436087,7.4848607186112234E-2,-3.9032652057496467E-2,{"$error":"#N/A"},3,{"$error":"#N/A"},43,1]
[null,"R1F",{"$f":"VLOOKUP(B5,#REF!,4,FALSE)","v":{"$error":"#REF!"}},{"$f":"VLOOKUP(B5,'FY 23-24'!$E$16:$S$137,15,FALSE)","v":0.15600252437857534},{"$f":"VLOOKUP(B5,'FY 24-25'!$E$16:$S$135,15,FALSE)","v":9.9826447968420343E-2},-5.6176076410154999E-2,0.1559605008653161,9.9880891611366346E-2,-5.6079609253949753E-2,{"$error":"#N/A"},1,{"$error":"#N/A"},54,1]
[null,"RXR",{"$f":"VLOOKUP(B6,#REF!,4,FALSE)","v":{"$error":"#REF!"}},{"$f":"VLOOKUP(B6,'FY 23-24'!$E$16:$S$137,15,FALSE)","v":0.21028590311237355},{"$f":"VLOOKUP(B6,'FY 24-25'!$E$16:$S$135,15,FALSE)","v":0.17572442970915664},-3.4561473403216914E-2,0.15062335679755745,0.19046108710304088,3.9837730305483432E-2,{"$error":"#N/A"},115,{"$error":"#N/A"},113,1]
[null,"RWG",{"$f":"VLOOKUP(B7,#REF!,4,FALSE)","v":{"$error":"#REF!"}},{"$f":"VLOOKUP(B7,'FY 23-24'!$E$16:$S$137,15,FALSE)","v":9.7783785551546334E-2},{"$f":"VLOOKUP(B7,'FY 24-25'!$E$16:$S$135,15,FALSE)","v":7.0527278268820479E-2},-2.7256507282725856E-2,9.772182254196643E-2,7.0506959260388094E-2,-2.7214863281578336E-2,{"$error":"#N/A"},4,{"$error":"#N/A"},40,1]
[null,"RA2",{"$f":"VLOOKUP(B8,#REF!,4,FALSE)","v":{"$error":"#REF!"}},{"$f":"VLOOKUP(B8,'FY 23-24'!$E$16:$S$137,15,FALSE)","v":6.345288224190504E-2},{"$f":"VLOOKUP(B8,'FY 24-25'!$E$16:$S$135,15,FALSE)","v":3.7645432814854253E-2},-2.5807449427050787E-2,6.2134727776068904E-2,3.7681323662737985E-2,-2.4453404113330919E-2,{"$error":"#N/A"},6,{"$error":"#N/A"},13,1]
[null,"RJ7",{"$f":"VLOOKUP(B9,#REF!,4,FALSE)","v":{"$error":"#REF!"}},{"$f":"VLOOKUP(B9,'FY 23-24'!$E$16:$S$137,15,FALSE)","v":0.1052542955095003},{"$f":"VLOOKUP(B9,'FY 24-25'!$E$16:$S$135,15,FALSE)","v":8.6915603288399257E-2},-1.8338692221101044E-2,0.10466408486277151,6.3389348150155844E-2,-4.1274736712615667E-2,{"$error":"#N/A"},2,{"$error":"#N/A"},37,1]
[null,"RTE",{"$f":"VLOOKUP(B10,#REF!,4,FALSE)","v":{"$error":"#REF!"}},{"$f":"VLOOKUP(B10,'FY 23-24'!$E$16:$S$137,15,FALSE)","v":0.139669146957215},{"$f":"VLOOKUP(B10,'FY 24-25'!$E$16:$S$135,15,FALSE)","v":0.11715311297712876},-2.2516033980086239E-2,0.13968243422800958,0.11712959979377457,-2.2552834434235003E-2,{"$error":"#N/A"},7,{"$error":"#N/A"},70,1]
[null,"RM1",{"$f":"VLOOKUP(B11,#REF!,4,FALSE)","v":{"$error":"#REF!"}},{"$f":"VLOOKUP(B11,'FY 23-24'!$E$16:$S$137,15,FALSE)","v":7.0232657669291113E-2},{"$f":"VLOOKUP(B11,'FY 24-25'!$E$16:$S$135,15,FALSE)","v":4.7743287384185547E-2},-2.2489370285105566E-2,7.0242750682505725E-2,4.7755982335421589E-2,-2.2486768347084136E-2,{"$error":"#N/A"},8,{"$error":"#N/A"},21,1]
[null,"RX1",{"$f":"VLOOKUP(B12,#REF!,4,FALSE)","v":{"$error":"#REF!"}},{"$f":"VLOOKUP(B12,'FY 23-24'!$E$16:$S$137,15,FALSE)","v":0.1292964833626544},{"$f":"VLOOKUP(B12,'FY 24-25'!$E$16:$S$135,15,FALSE)","v":0.10952705924146248},-1.9769424121191911E-2,0.12929464897968834,0.10932385672870101,-1.9970792250987329E-2,{"$error":"#N/A"},9,{"$error":"#N/A"},63,1]
[null,"RNS",{"$f":"VLOOKUP(B13,#REF!,4,FALSE)","v":{"$error":"#REF!"}},{"$f":"VLOOKUP(B13,'FY 23-24'!$E$16:$S$137,15,FALSE)","v":0.16455038178347423},{"$f":"VLOOKUP(B13,'FY 24-25'!$E$16:$S$135,15,FALSE)","v":0.14545621806756584},-1.9094163715908385E-2,0.16377400295420974,0.14542495223267993,-1.8349050721529814E-2,{"$error":"#N/A"},10,{"$error":"#N/A"},95,1]
[null,"RN3",{"$f":"VLOOKUP(B14,#REF!,4,FALSE)","v":{"$error":"#REF!"}},{"$f":"VLOOKUP(B14,'FY 23-24'!$E$16:$S$137,15,FALSE)","v":0.15181920331713802},{"$f":"VLOOKUP(B14,'FY 24-25'!$E$16:$S$135,15,FALSE)","v":0.13406845853434413},-1.7750744782793898E-2,0.15177652923953469,0.13419117647058823,-1.7585352768946461E-2,{"$error":"#N/A"},11,{"$error":"#N/A"},88,1]
[null,"RVR",{"$f":"VLOOKUP(B15,#REF!,4,FALSE)","v":{"$error":"#REF!"}},{"$f":"VLOOKUP(B15,'FY 23-24'!$E$16:$S$137,15,FALSE)","v":0.13987106608656991},{"$f":"VLOOKUP(B15,'FY 24-25'!$E$16:$S$135,15,FALSE)","v":0.12241326570536305},-1.7457800381206853E-2,0.13992187748102511,0.12243010599701216,-1.7491771484012944E-2,{"$error":"#N/A"},12,{"$error":"#N/A"},75,1]
[null,"RK9",{"$f":"VLOOKUP(B16,#REF!,4,FALSE)","v":{"$error":"#REF!"}},{"$f":"VLOOKUP(B16,'FY 23-24'!$E$16:$S$137,15,FALSE)","v":0.18217654101089145},{"$f":"VLOOKUP(B16,'FY 24-25'!$E$16:$S$135,15,FALSE)","v":{"$error":"#N/A"}},{"$error":"#N/A"},0.18212790810863427,0.1649541793946126,-1.7173728714021674E-2,{"$error":"#N/A"},13,{"$error":"#N/A"},106,{"$error":"#N/A"}]
[null,"RTX",{"$f":"VLOOKUP(B17,#REF!,4,FALSE)","v":{"$error":"#REF!"}},{"$f":"VLOOKUP(B17,'FY 23-24'!$E$16:$S$137,15,FALSE)","v":8.8717996811403924E-2},{"$f":"VLOOKUP(B17,'FY 24-25'!$E$16:$S$135,15,FALSE)","v":7.2797040382620512E-2},-1.5920956428783412E-2,8.8777743044701471E-2,7.28382595924362E-2,-1.5939483452265271E-2,{"$error":"#N/A"},14,{"$error":"#N/A"},42,1]
[null,"RH8",{"$f":"VLOOKUP(B18,#REF!,4,FALSE)","v":{"$error":"#REF!"}},{"$f":"VLOOKUP(B18,'FY 23-24'!$E$16:$S$137,15,FALSE)","v":5.2241656888694844E-2},{"$f":"VLOOKUP(B18,'FY 24-25'!$E$16:$S$135,15,FALSE)","v":3.9597103797092664E-2},-1.264455309160218E-2,5.222047888669077E-2,4.0715565926076225E-2,-1.1504912960614545E-2,{"$error":"#N/A"},15,{"$error":"#N/A"},14,1]
[null,"RJZ",{"$f":"VLOOKUP(B19,#REF!,4,FALSE)","v":{"$error":"#REF!"}},{"$f":"VLOOKUP(B19,'FY 23-24'!$E$16:$S$137,15,FALSE)","v":0.15310698633084563},{"$f":"VLOOKUP(B19,'FY 24-25'!$E$16:$S$135,15,FALSE)","v":0.14296085268333461},-1.0146133647511019E-2,0.13345165168603654,0.14305692662059888,9.6052749345623412E-3,{"$error":"#N/A"},70,{"$error":"#N/A"},93,1]
[null,"RWW",{"$f":"VLOOKUP(B20,#REF!,4,FALSE)","v":{"$error":"#REF!"}},{"$f":"VLOOKUP(B20,'FY 23-24'!$E$16:$S$137,15,FALSE)","v":0.21722293514428154},{"$f":"VLOOKUP(B20,'FY 24-25'!$E$16:$S$135,15,FALSE)","v":0.20606239311198915},-1.1160542032292387E-2,0.21634998293321198,0.20821045181078213,-8.1395311224298494E-3,{"$error":"#N/A"},21,{"$error":"#N/A"},117,1]
{"$rows_left_out":104}
{"sheet":"Sheet2","index":4,"n_rows":15,"n_cols":8,"rows_kept":15,"cut":false,"hidden":true,"merged":[]}
[]
[]
[]
[]
[]
[null,null,null,null,null,"RCU","Sheffield Children's NHS Foundation Trust","Birmingham Women's and Children's NHS Foundation Trust"]
[null,null,null,null,null,"RQ3","Birmingham Women's and Children's NHS Foundation Trust","University Hospital Southampton NHS Foundation Trust"]
[null,null,null,null,null,"RHM","University Hospital Southampton NHS Foundation Trust","Royal Surrey County Hospital NHS Foundation Trust"]
[null,null,null,null,null,"RA2","Royal Surrey County Hospital NHS Foundation Trust","Royal Devon University Healthcare NHS Foundation Trust"]
[null,null,null,null,null,"RH8","Royal Devon University Healthcare NHS Foundation Trust","Doncaster and Bassetlaw Teaching Hospitals NHS Foundation Trust"]
[null,null,null,null,null,"RP5","Doncaster and Bassetlaw Teaching Hospitals NHS Foundation Trust","Oxford University Hospitals NHS Foundation Trust"]
[null,null,null,null,null,"RTH","Oxford University Hospitals NHS Foundation Trust","Norfolk and Norwich University Hospitals NHS Foundation Trust"]
[null,null,null,null,null,"RM1","Norfolk and Norwich University Hospitals NHS Foundation Trust","The Rotherham NHS Foundation Trust"]
[null,null,null,null,null,"RFR","The Rotherham NHS Foundation Trust","Bradford Teaching Hospitals NHS Foundation Trust"]
[null,null,null,null,null,"R0D","University Hospitals Dorset NHS Foundation Trust","University Hospitals Dorset NHS Foundation Trust"]