{"text_format":"1","workbook":"xlsx","n_sheets":6,"sheets":["Front Sheet","Guidance","Trust Dashboard","Trust SJR Comparison","Workings","Data"],"not_rendered":{"charts":5,"images":3,"macros":0,"external_links":0,"defined_names":10,"comments":1,"pivot_tables":0},"unopened":[],"bounds":{"document_bytes":16777216,"sheet_cells":100000,"rows_first":2000,"rows_last":500,"rows_between":2000,"halvings":0,"cell_chars":16384,"cell_head_chars":4096},"cells_cut":0,"cells_raw":0,"read":"whole","date_system":"1900"}

{"sheet":"Front Sheet","index":0,"n_rows":31,"n_cols":5,"rows_kept":31,"cut":false,"hidden":false,"merged":[[5,4,5,5],[7,4,7,5],[9,4,9,5]]}
[null,null,null,null,"Learning from Deaths Dashboard"]
[]
[]
[]
[]
[null,null,null,"Organisation","NHS Anytown Foundation Trust"]
[]
[null,null,null,"Financial Year","2017-18"]
[]
[null,null,null,"Month","September"]
{"$rows_left_out":22}
{"sheet":"Guidance","index":1,"n_rows":19,"n_cols":4,"rows_kept":19,"cut":false,"hidden":false,"merged":[[3,1,3,3],[18,1,18,3],[8,1,8,3],[12,1,12,3]]}
[null,null,null,"Learning from Deaths Dashboard"]
[]
[null,"Purpose of the dashboard"]
[null,"This suggested dashboard is a tool to aid the systematic recording of deaths and learning from the care provided by NHS Trusts and NHS Foundation Trusts. Trusts may use this to record relevant incidents of mortality, deaths reviewed and lessons learnt to encourage future learning and the improvement of care. \n\nGuidance on what should be recorded in individual fields is provided below, alongside instructions for completing and updating the dashboard. This guidance on individual fields complements the wider guidance provided in National Guidance on Learning From Deaths and separate methodology guidance on the Structured Judgement Review (SJR) as developed by the Royal College of Physicians (RCP). The dashboard is not prescriptive and Trusts may set their own definitions according to local goals and data availability, although minimum requirements are set out in the national guidance.\n"]
[null,"To update this dashboard - enter your data on the \"Data\" worksheet. The dashboard sheet is automatically updated. "]
[null,"Guidance on individual fields"]
[]
[null,"Field No.","Field","Description of Field"]
[null,"Recording data on structured judgement reviews:"]
[null,1,"Total Number of Deaths in scope","This must as a minimum include all adult inpatient deaths excluding maternity services. Where additional deaths are included (for example maternal deaths, deaths post-discharge or deaths of outpatients etc) the inclusion criteria should be made clear in this field, which can vary by trust. The total number of deaths in scope defined in this field must be used in all subsequent relevant fields in this work book. If a post-discharge period is being included in scope, (eg deaths within 30 days of discharge) then the death should be counted in the month where the death actually occurred rather than time of admittance or discharge. \n\nNote that where it has been identified that a patient has a learning disability the death should be recorded separately (see Data item 6, below)."]
{"$rows_left_out":10}
{"sheet":"Trust Dashboard","index":2,"n_rows":53,"n_cols":31,"rows_kept":53,"cut":false,"hidden":false,"merged":[[5,1,7,14],[13,3,13,4],[13,8,13,9],[13,13,13,14],[15,3,15,4],[15,13,15,14],[9,1,9,4],[9,11,9,14],[11,3,11,4],[11,8,11,9],[11,13,11,14],[36,1,38,14],[9,6,9,9],[23,1,23,30],[26,1,26,4],[26,6,26,9],[26,11,26,14],[26,16,26,19],[21,3,21,4],[21,8,21,9],[21,13,21,14],[25,1,25,4],[25,6,25,9],[25,11,25,14],[25,16,25,19],[25,27,25,29],[15,8,15,9],[17,3,17,4],[17,8,17,9],[17,13,17,14],[19,3,19,4],[19,8,19,9],[19,13,19,14],[46,8,46,9],[46,13,46,14],[40,1,40,4],[40,6,40,9],[40,11,40,14],[42,3,42,4],[42,8,42,9],[42,13,42,14],[1,1,1,30],[3,1,3,30],[52,3,52,4],[52,8,52,9],[52,13,52,14],[34,1,34,30],[48,3,48,4],[48,8,48,9],[48,13,48,14],[50,3,50,4],[50,8,50,9],[50,13,50,14],[44,3,44,4],[44,8,44,9],[44,13,44,14],[46,3,46,4]]}
[null,null,null,null,null,null,{"$f":"CONCATENATE(Data!F1, \":  Learning from Deaths Dashboard -  \", Data!F3, \" \", Data!F4 )","v":"NHS Anytown Foundation Trust:  Learning from Deaths Dashboard -  September 2017-18"}]
[null,"Description:\nThe suggested dashboard is a tool to aid the systematic recording of deaths and learning from care provided by NHS Trusts. Trusts are encouraged to use this to record relevant incidents of mortality, number of deaths reviewed and cases from which lessons can be learnt to improve care. "]
[]
[null,"Summary of total number of deaths and total number of cases reviewed under the Structured Judgement Review Methodology"]
[]
[null,"Total Number of Deaths, Deaths Reviewed and Deaths Deemed more likely than not due to problems in care (does not include patients with identified learning disabilities)",null,null,null,null,null,null,null,null,null,null,null,null,null,null,"Time Series:",null,"Start date","2017-18",null,"Q1",null,null,"End date",null,null,"2018-19",null,"Q2"]
[]
[]
[]
[null,"Total Number of Deaths in Scope  ",null,null,null,null,"Total Deaths Reviewed",null,null,null,null,"Total Number of deaths considered more likely than not due to problems in care           \nPRISM Score<=3 or equivalent measure"]
{"$rows_left_out":44}
{"sheet":"Trust SJR Comparison","index":3,"n_rows":12,"n_cols":22,"rows_kept":12,"cut":false,"hidden":true,"merged":[[1,2,1,22],[3,4,3,6],[3,16,3,21],[3,9,3,14]]}
[null,null,null,null,{"$f":"CONCATENATE(Data!F1, \":  Learning from Deaths Dashboard -  \", Data!F3, \" \", Data!F4 )","v":"NHS Anytown Foundation Trust:  Learning from Deaths Dashboard -  September 2017-18"}]
[null,null,"Description:\nSmall differences in review practices can mean that comparisons between Trusts do not give a fair picture. It is open to Trusts to use data from other organisations to consider whether their own review processes are as comprehensive as others. Trusts are able to select their own peers or comparator organisations, and can use this locally to challenge themselves if their findings are very different. There is no central mechanism to provide you with data from other Trusts – this material is for local use and might be drawn, for example, from the dashboards published by other organisations\n"]
[]
[null,null,null,null,"Total Deaths in scope",null,null,null,null,"Total Deaths Reviewed",null,null,null,null,null,null,"Total number of  deaths considered to have more than a 50% chance of having been avoidable\n(RCP <= 3)"]
[]
[null,"Organisation Name",null,null,"This Month","This Quarter (QTD)","This Year (YTD)",null,null,"This Month","This Month %","This Quarter (QTD)","This Quarter % (QTD)","This Year (YTD)","This Year % (YTD)",null,"This Month","This Month %","This Quarter (QTD)","This Quarter % (QTD)","This Year (YTD)","This Year % (YTD)"]
[]
[null,{"$f":"Data!F1","v":"NHS Anytown Foundation Trust"},null,null,{"$f":"Workings!E8","v":454},{"$f":"Workings!E44","v":1436},{"$f":"Workings!E80","v":6069},null,null,{"$f":"Workings!E9","v":339},{"$f":"IFERROR(J8/E8, \"-\")","v":0.74669603524229078},{"$f":"Workings!E45","v":939},{"$f":"IFERROR(L8/F8, \"-\")","v":0.65389972144846797},{"$f":"Workings!E81","v":3991},{"$f":"IFERROR(N8/G8, \"-\")","v":0.65760421815785142},null,{"$f":"Workings!E10","v":14},{"$f":"IFERROR(Q8/E8, \"-\")","v":3.0837004405286344E-2},{"$f":"Workings!E46","v":50},{"$f":"IFERROR(S8/F8, \"-\")","v":3.4818941504178275E-2},{"$f":"Workings!E82","v":227},{"$f":"IFERROR(U8/G8, \"-\")","v":3.7403196572746746E-2}]
[null,{"$f":"IF(ISBLANK(Data!$S$6),\"-\",Data!S6)","v":"Comparison trust 1"},null,null,{"$f":"IF(ISBLANK(Data!$S$6),\"-\",Workings!E20)","v":376},{"$f":"IF(ISBLANK(Data!$S$6),\"-\",Workings!E56)","v":1035},{"$f":"IF(ISBLANK(Data!$S$6),\"-\",Workings!E92)","v":4057},null,null,{"$f":"IF(ISBLANK(Data!$S$6),\"-\",Workings!E21)","v":266},{"$f":"IFERROR(J9/E9, \"-\")","v":0.70744680851063835},{"$f":"IF(ISBLANK(Data!$S$6),\"-\",Workings!E57)","v":719},{"$f":"IFERROR(L9/F9, \"-\")","v":0.69468599033816425},{"$f":"IF(ISBLANK(Data!$S$6),\"-\",Workings!E93)","v":2363},{"$f":"IFERROR(N9/G9, \"-\")","v":0.58245008627064332},null,{"$f":"IF(ISBLANK(Data!$S$6),\"-\",Workings!E22)","v":40},{"$f":"IFERROR(Q9/E9, \"-\")","v":0.10638297872340426},{"$f":"IF(ISBLANK(Data!$S$6),\"-\",Workings!E58)","v":106},{"$f":"IFERROR(S9/F9, \"-\")","v":0.10241545893719807},{"$f":"IF(ISBLANK(Data!$S$6),\"-\",Workings!E94)","v":343},{"$f":"IFERROR(U9/G9, \"-\")","v":8.4545230465861473E-2}]
[null,{"$f":"IF(ISBLANK(Data!$V$6),\"-\",Data!V6)","v":"Comparison trust 2"},null,null,{"$f":"IF(ISBLANK(Data!$V$6),\"-\",Workings!E23)","v":396},{"$f":"IF(ISBLANK(Data!$V$6),\"-\",Workings!E59)","v":1087},{"$f":"IF(ISBLANK(Data!$V$6),\"-\",Workings!E95)","v":4186},null,null,{"$f":"IF(ISBLANK(Data!$V$6),\"-\",Workings!E24)","v":326},{"$f":"IFERROR(J10/E10, \"-\")","v":0.8232323232323232},{"$f":"IF(ISBLANK(Data!$V$6),\"-\",Workings!E60)","v":625},0.57497700091996318,{"$f":"IF(ISBLANK(Data!$V$6),\"-\",Workings!E96)","v":2183},{"$f":"IFERROR(N10/G10, \"-\")","v":0.52150023889154329},null,{"$f":"IF(ISBLANK(Data!$V$6),\"-\",Workings!E25)","v":42},0.10606060606060606,{"$f":"IF(ISBLANK(Data!$V$6),\"-\",Workings!E61)","v":86},7.9116835326586935E-2,{"$f":"IF(ISBLANK(Data!$V$6),\"-\",Workings!E97)","v":302},7.2145246058289536E-2]
{"$rows_left_out":3}
{"sheet":"Workings","index":4,"n_rows":115,"n_cols":34,"rows_kept":115,"cut":false,"hidden":true,"merged":[]}
["WORKINGS (do not delete!)",null,null,null,null,null,null,null,null,null,null,null,null,null,null,null,null,null,null,null,"FOR TIMESERIES CHART (also powered by named ranges)",null,null,null,null,null,null,null,null,"FOR TIMESERIES CHART (also powered by named ranges)"]
[null,null,null,null,null,null,null,null,null,null,null,null,null,null,null,null,null,null,null,null,"time series start","code",null,"time series end","code",null,null,null,null,"time series start","code",null,"time series end","code"]
[null,"year",{"$f":"Data!F4","v":"2017-18"},null,null,null,null,null,null,null,null,null,null,null,null,null,null,null,null,null,{"$f":"'Trust Dashboard'!V6&\" \"&'Trust Dashboard'!T6","v":"Q1 2017-18"},{"$f":"VLOOKUP(U3, U8:V127, 2, 0)","v":1},null,{"$f":"'Trust Dashboard'!AD6&\" \"&'Trust Dashboard'!AB6","v":"Q2 2018-19"},{"$f":"VLOOKUP(X3, U8:V127, 2, 0)","v":6},null,null,null,null,{"$f":"'Trust Dashboard'!$V$37&\" \"&'Trust Dashboard'!$T$37","v":"Q1 2017-18"},{"$f":"VLOOKUP(AD3, U8:V47, 2, 0)","v":1},null,{"$f":"'Trust Dashboard'!$AD$37&\" \"&'Trust Dashboard'!$AB$37","v":"Q1 2018-19"},{"$f":"VLOOKUP(AG3, U8:V127, 2, 0)","v":5}]
[null,"month",{"$f":"Data!F3","v":"September"}]
[null,"lookup",{"$f":"C3&C4","v":"2017-18September"}]
[null,null,null,null,null,null,null,"drop downs",null,null,null,"Quarter table for time series",null,null,null,null,null,null,null,null,"time series lookups",null,null,null,"time series chart data table",null,null,null,null,"time series chart data table"]
[null,"ind_0","ind","data col","lookup",null,null,"year","month","quarter",null,"Quarter","Total Deaths (not LD)","Total Deaths Reviewed","Deaths Avoidable > 50%","LD Deaths","LD Deaths Reviewed","LD Deaths Avoidable > 50%",null,null,"date","lookup code",null,null,"date","deaths","reviewed","More likely than not due to problems in care",null,"date","deaths","reviewed","More likely than not due to problems in care"]
["this month",null,"Total Deaths",4,{"$f":"VLOOKUP($C$5, Data!$D$8:$DJ$127, Workings!$D8, 0)","v":454},null,null,"2017-18","April","Q1",null,"Q1 2017-18",{"$f":"VLOOKUP($L8, Data!$B$8:$BB$127, 42, 0)","v":1509},{"$f":"VLOOKUP($L8, Data!$B$8:$BB$127, 43, 0)","v":1053},{"$f":"VLOOKUP($L8, Data!$B$8:$BB$127, 44, 0)","v":54},{"$f":"VLOOKUP($L8, Data!$B$8:$BB$127, 51, 0)","v":24},{"$f":"VLOOKUP($L8, Data!$B$8:$BB$127, 52, 0)","v":24},{"$f":"VLOOKUP($L8, Data!$B$8:$BB$127, 53, 0)","v":4},"Q1 2017-18",null,"Q1 2017-18",1,null,null,{"$f":"IF(   AND(V8 >= $V$3, V8<=$Y$3), S8, \"\")","v":"Q1 2017-18"},{"$f":"IF(IF(   AND(V8 >= $V$3, V8<=$Y$3), M8, NA() ) = 0, NA(), IF(   AND(V8 >= $V$3, V8<=$Y$3), M8, NA() ))","v":1509},{"$f":"IF(IF(   AND(V8 >= $V$3, V8<=$Y$3), N8, NA() ) = 0, NA(), IF(   AND(V8 >= $V$3, V8<=$Y$3), N8, NA() ))","v":1053},{"$f":"IF(IF(   AND(V8 >= $V$3, V8<=$Y$3), O8, NA() ) = 0, NA(), IF(   AND(V8 >= $V$3, V8<=$Y$3), O8, NA() ))","v":54},null,{"$f":"IF(   AND(V8 >= $AE$3, V8<=$AH$3), S8, \"\")","v":"Q1 2017-18"},{"$f":"IF(IF(   AND(V8 >= $AE$3, V8<=$AH$3), P8, NA()) = 0, NA(), IF(   AND(V8 >= $AE$3, V8<=$AH$3), P8, NA()))","v":24},{"$f":"IF(IF(   AND(V8 >= $AE$3, V8<=$AH$3), Q8, NA()) = 0, NA(), IF(   AND(V8 >= $AE$3, V8<=$AH$3), Q8, NA()))","v":24},{"$f":"IF(IF(   AND(V8 >= $AE$3, V8<=$AH$3), R8, NA()) = 0, NA(), IF(   AND(V8 >= $AE$3, V8<=$AH$3), R8, NA()))","v":4}]
[null,null,"Total Deaths Reviewed",5,{"$f":"VLOOKUP($C$5, Data!$D$8:$DJ$127, Workings!$D9, 0)","v":339},null,null,"2018-19","May","Q2",null,"Q2 2017-18",{"$f":"VLOOKUP($L9, Data!$B$8:$BB$127, 42, 0)","v":1436},{"$f":"VLOOKUP($L9, Data!$B$8:$BB$127, 43, 0)","v":939},{"$f":"VLOOKUP($L9, Data!$B$8:$BB$127, 44, 0)","v":50},{"$f":"VLOOKUP($L9, Data!$B$8:$BB$127, 51, 0)","v":16},{"$f":"VLOOKUP($L9, Data!$B$8:$BB$127, 52, 0)","v":16},{"$f":"VLOOKUP($L9, Data!$B$8:$BB$127, 53, 0)","v":3},"Q2",null,"Q2 2017-18",2,null,null,{"$f":"IF(   AND(V9 >= $V$3, V9<=$Y$3), S9, \"\")","v":"Q2"},{"$f":"IF(IF(   AND(V9 >= $V$3, V9<=$Y$3), M9, NA() ) = 0, NA(), IF(   AND(V9 >= $V$3, V9<=$Y$3), M9, NA() ))","v":1436},{"$f":"IF(IF(   AND(V9 >= $V$3, V9<=$Y$3), N9, NA() ) = 0, NA(), IF(   AND(V9 >= $V$3, V9<=$Y$3), N9, NA() ))","v":939},{"$f":"IF(IF(   AND(V9 >= $V$3, V9<=$Y$3), O9, NA() ) = 0, NA(), IF(   AND(V9 >= $V$3, V9<=$Y$3), O9, NA() ))","v":50},null,{"$f":"IF(   AND(V9 >= $AE$3, V9<=$AH$3), S9, \"\")","v":"Q2"},{"$f":"IF(IF(   AND(V9 >= $AE$3, V9<=$AH$3), P9, NA()) = 0, NA(), IF(   AND(V9 >= $AE$3, V9<=$AH$3), P9, NA()))","v":16},{"$f":"IF(IF(   AND(V9 >= $AE$3, V9<=$AH$3), Q9, NA()) = 0, NA(), IF(   AND(V9 >= $AE$3, V9<=$AH$3), Q9, NA()))","v":16},{"$f":"IF(IF(   AND(V9 >= $AE$3, V9<=$AH$3), R9, NA()) = 0, NA(), IF(   AND(V9 >= $AE$3, V9<=$AH$3), R9, NA()))","v":3}]
[null,null,"Deaths Avoidable",6,{"$f":"VLOOKUP($C$5, Data!$D$8:$DJ$127, Workings!$D10, 0)","v":14},null,null,"2019-20","June","Q3",null,"Q3 2017-18",{"$f":"VLOOKUP($L10, Data!$B$8:$BB$127, 42, 0)","v":1565},{"$f":"VLOOKUP($L10, Data!$B$8:$BB$127, 43, 0)","v":979},{"$f":"VLOOKUP($L10, Data!$B$8:$BB$127, 44, 0)","v":67},{"$f":"VLOOKUP($L10, Data!$B$8:$BB$127, 51, 0)","v":11},{"$f":"VLOOKUP($L10, Data!$B$8:$BB$127, 52, 0)","v":11},{"$f":"VLOOKUP($L10, Data!$B$8:$BB$127, 53, 0)","v":3},"Q3",null,"Q3 2017-18",3,null,null,"Q3",1565,979,67,null,"Q3",11,11,3]
{"$rows_left_out":106}
{"sheet":"Data","index":5,"n_rows":127,"n_cols":114,"rows_kept":127,"cut":false,"hidden":false,"merged":[[5,9,5,14]]}
[null,null,null,null,"Trust",{"$f":"'Front Sheet'!E6","v":"NHS Anytown Foundation Trust"}]
[null,null,null,null,"Org Code"]
[null,null,null,null,"Month",{"$f":"'Front Sheet'!E10","v":"September"}]
[null,null,null,null,"Year",{"$f":"'Front Sheet'!E8","v":"2017-18"},null,null,null,null,null,null,null,null,null,null,null,null,null,null,null,null,null,null,null,null,null,null,null,null,"Previous month",null,null,null,null,null,null,null,null,null,null,null,"This Quarter",null,null,null,null,null,null,null,null,null,null,null,null,null,null,null,null,null,null,null,null,null,null,null,"Previous quarter",null,null,null,null,null,null,null,null,null,null,null,"This year",null,null,null,null,null,null,null,null,null,null,null,null,null,null,null,null,null,null,null,null,null,null,null,"Previous year"]
[]
[null,null,null,null,null,null,null,null,null,"PRISM Score",null,null,null,null,null,null,null,null,"Comparison trust 1",null,null,"Comparison trust 2",null,null,"Comparison trust 3",null,null,null,null,null,null,null,null,null,null,null,null,null,null,null,null,null,null,null,null,null,null,null,null,null,null,null,null,null,"Comparison trust 1",null,null,"Comparison trust 2",null,null,"Comparison trust 3",null,null,"Comparison trust 4",null,null,null,null,null,null,null,null,null,null,null,null,null,null,null,null,null,null,null,null,null,null,null,null,null,null,"Comparison trust 1",null,null,"Comparison trust 2",null,null,"Comparison trust 3",null,null,"Comparison trust 4"]
["quart","quart code","month","month code","Financial Year","Month","Total Deaths (not LD)","Total Deaths Reviewed (not LD)","Deaths Avoidable > 50% (not LD)",1,2,3,4,5,6,"LD Deaths","LD Deaths Reviewed","LD Deaths Avoidable > 50%","Total Deaths","Total Deaths Reviewed","Deaths Avoidable > 50%","Total Deaths","Total Deaths Reviewed","Deaths Avoidable > 50%","Total Deaths","Total Deaths Reviewed","Deaths Avoidable > 50%","Total Deaths","Total Deaths Reviewed","Deaths Avoidable > 50%","Total Deaths","Total Deaths Reviewed","Deaths Avoidable","RCP1","RCP2","RCP3","RCP4","RCP5","RCP6","LD Deaths","LD Deaths Reviewed","LD Deaths Avoidable > 50%","Total Deaths","Total Deaths Reviewed","Deaths Avoidable","RCP1","RCP2","RCP3","RCP4","RCP5","RCP6","LD Deaths","LD Deaths Reviewed","LD Deaths Avoidable > 50%","Total Deaths","Total Deaths Reviewed","Deaths Avoidable","Total Deaths","Total Deaths Reviewed","Deaths Avoidable","Total Deaths","Total Deaths Reviewed","Deaths Avoidable","Total Deaths","Total Deaths Reviewed","Deaths Avoidable","Total Deaths","Total Deaths Reviewed","Deaths Avoidable","RCP1","RCP2","RCP3","RCP4","RCP5","RCP6","LD Deaths","LD Deaths Reviewed","LD Deaths Avoidable > 50%","Total Deaths","Total Deaths Reviewed","Deaths Avoidable","RCP1","RCP2","RCP3","RCP4","RCP5","RCP6","LD Deaths","LD Deaths Reviewed","LD Deaths Avoidable > 50%","Total Deaths","Total Deaths Reviewed","Deaths Avoidable","Total Deaths","Total Deaths Reviewed","Deaths Avoidable","Total Deaths","Total Deaths Reviewed","Deaths Avoidable","Total Deaths","Total Deaths Reviewed","Deaths Avoidable","Total Deaths","Total Deaths Reviewed","Deaths Avoidable","RCP1","RCP2","RCP3","RCP4","RCP5","RCP6","LD Deaths","LD Deaths Reviewed","LD Deaths Avoidable > 50%"]
["Q1",{"$f":"A8&\" \"&E8","v":"Q1 2017-18"},"Apr, 17-18",{"$f":"E8&F8","v":"2017-18April"},"2017-18","April",509,358,15,1,4,10,34,69,240,4,4,0,389,205,47,313,217,33,344,56,7,null,null,null,0,0,0,0,0,0,0,0,0,0,0,0,{"$f":"SUM(G$8:G$10)","v":1509},1053,54,{"$f":"SUM(J$8:J$10)","v":6},11,37,99,200,700,24,24,4,1026,{"$f":"SUM(T$8:T$10)","v":492},82,1054,331,46,994,395,58,0,0,{"$f":"SUM(AD$8:AD$10)","v":0},0,0,0,0,0,0,0,0,0,0,0,0,{"$f":"SUM(G$8:G$19)","v":6069},{"$f":"SUM(H$8:H$19)","v":3991},{"$f":"SUM(I$8:I$19)","v":227},{"$f":"SUM(J$8:J$19)","v":30},{"$f":"SUM(K$8:K$19)","v":65},{"$f":"SUM(L$8:L$19)","v":132},{"$f":"SUM(M$8:M$19)","v":378},{"$f":"SUM(N$8:N$19)","v":754},{"$f":"SUM(O$8:O$19)","v":2632},{"$f":"SUM(P$8:P$19)","v":75},75,19,{"$f":"SUM(S$8:S$19)","v":4057},{"$f":"SUM(T$8:T$19)","v":2363},{"$f":"SUM(U$8:U$19)","v":343},{"$f":"SUM(V$8:V$19)","v":4186},{"$f":"SUM(W$8:W$19)","v":2183},{"$f":"SUM(X$8:X$19)","v":302},{"$f":"SUM(Y$8:Y$19)","v":4073},{"$f":"SUM(Z$8:Z$19)","v":1773},{"$f":"SUM(AA$8:AA$19)","v":269},{"$f":"SUM(AB$8:AB$19)","v":0},{"$f":"SUM(AC$8:AC$19)","v":0},{"$f":"SUM(AD$8:AD$19)","v":0},0,0,0,0,0,0,0,0,0,0,0,0]
["Q1",{"$f":"A9&\" \"&E9","v":"Q1 2017-18"},"May",{"$f":"E9&F9","v":"2017-18May"},"2017-18","May",478,350,18,3,5,10,33,66,233,8,8,2,328,62,8,378,71,7,308,144,22,null,null,null,{"$f":"G8","v":509},{"$f":"H8","v":358},15,1,4,10,34,69,{"$f":"O8","v":240},{"$f":"P8","v":4},4,0,1509,1053,54,6,11,37,99,200,700,24,24,4,1026,492,82,1054,331,46,994,395,58,0,0,0,0,0,0,0,0,0,0,0,0,0,0,0,6069,3991,227,30,65,132,378,754,2632,75,75,19,4057,2363,343,4186,2183,302,4073,1773,269,0,0,0,0,0,0,0,0,0,0,0,0,0,0,0]
["Q1","Q1 2017-18","Jun","2017-18June","2017-18","June",522,345,21,2,2,17,32,65,227,12,12,2,309,225,27,363,43,6,342,195,29,null,null,null,{"$f":"G9","v":478},{"$f":"H9","v":350},{"$f":"I9","v":18},{"$f":"J9","v":3},{"$f":"K9","v":5},{"$f":"L9","v":10},{"$f":"M9","v":33},{"$f":"N9","v":66},233,8,8,2,1509,1053,54,6,11,37,99,200,700,24,24,4,1026,492,82,1054,331,46,994,395,58,0,0,0,0,0,0,0,0,0,0,0,0,0,0,0,6069,3991,227,30,65,132,378,754,2632,75,75,19,4057,2363,343,4186,2183,302,4073,1773,269,0,0,0,0,0,0,0,0,0,0,0,0,0,0,0]
{"$rows_left_out":117}