{"text_format":"1","workbook":"xlsx","n_sheets":6,"sheets":["Front Sheet","Guidance","Trust Dashboard","Trust SJR Comparison","Workings","Data"],"not_rendered":{"charts":5,"images":3,"macros":0,"external_links":0,"defined_names":10,"comments":1,"pivot_tables":0},"unopened":[],"bounds":{"document_bytes":16777216,"sheet_cells":100000,"rows_first":2000,"rows_last":500,"rows_between":2000,"halvings":0,"cell_chars":16384,"cell_head_chars":4096},"cells_cut":0,"cells_raw":0,"read":"whole","date_system":"1900"}

{"sheet":"Front Sheet","index":0,"n_rows":31,"n_cols":5,"rows_kept":31,"cut":false,"hidden":false,"merged":[[5,4,5,5],[7,4,7,5],[9,4,9,5]]}
[null,null,null,null,"Learning from Deaths Dashboard"]
[]
[]
[]
[]
[null,null,null,"Organisation","NHS Anytown Foundation Trust"]
[]
[null,null,null,"Financial Year","2017-18"]
[]
[null,null,null,"Month","September"]
[]
[]
[]
[]
["2017-18"]
["2018-19"]
["2019-20"]
["2020-21"]
["2021-22"]
["April"]
["May"]
["June"]
["July"]
["August"]
["September"]
["October"]
["November"]
["December"]
["January",null,"Learning from deaths dashboard V2.1, updated 08/03/2017"]
["February"]
["March"]

{"sheet":"Guidance","index":1,"n_rows":19,"n_cols":4,"rows_kept":19,"cut":false,"hidden":false,"merged":[[3,1,3,3],[18,1,18,3],[8,1,8,3],[12,1,12,3]]}
[null,null,null,"Learning from Deaths Dashboard"]
[]
[null,"Purpose of the dashboard"]
[null,"This suggested dashboard is a tool to aid the systematic recording of deaths and learning from the care provided by NHS Trusts and NHS Foundation Trusts. Trusts may use this to record relevant incidents of mortality, deaths reviewed and lessons learnt to encourage future learning and the improvement of care. \n\nGuidance on what should be recorded in individual fields is provided below, alongside instructions for completing and updating the dashboard. This guidance on individual fields complements the wider guidance provided in National Guidance on Learning From Deaths and separate methodology guidance on the Structured Judgement Review (SJR) as developed by the Royal College of Physicians (RCP). The dashboard is not prescriptive and Trusts may set their own definitions according to local goals and data availability, although minimum requirements are set out in the national guidance.\n"]
[null,"To update this dashboard - enter your data on the \"Data\" worksheet. The dashboard sheet is automatically updated. "]
[null,"Guidance on individual fields"]
[]
[null,"Field No.","Field","Description of Field"]
[null,"Recording data on structured judgement reviews:"]
[null,1,"Total Number of Deaths in scope","This must as a minimum include all adult inpatient deaths excluding maternity services. Where additional deaths are included (for example maternal deaths, deaths post-discharge or deaths of outpatients etc) the inclusion criteria should be made clear in this field, which can vary by trust. The total number of deaths in scope defined in this field must be used in all subsequent relevant fields in this work book. If a post-discharge period is being included in scope, (eg deaths within 30 days of discharge) then the death should be counted in the month where the death actually occurred rather than time of admittance or discharge. \n\nNote that where it has been identified that a patient has a learning disability the death should be recorded separately (see Data item 6, below)."]
[null,2,"Total Number of Deaths Reviewed under the SJR methodology","This is the total number of deaths for which the care provided to the patient has been reviewed by your Trust. This may be a combination of deaths reviewed under national and local minimum requirements and random sampling of all other deaths in scope."]
[null,3,"Total number of deaths considered to have more than a  50% chance of having been due to problems in care","The Structured Judgement Review methodology, for use in relation to adult acute inpatient deaths, allows for reviewers to score a death as having a more than 50% chance of having been due to problems in care when this judgement is made in relation to the care provided by the trust conducting the review. \n\nIf not using RCP SJR, then the method used to judge whether a death was more likely than not to have been due to problems in care in relation to the care provided by the Trust conducting the review (or another provider if appropriate) should be stated here including any definitions used. Note that if you are applying other methodologies to specific groups, such as learning disabilities patients, those methodologies may require a degree of judgement to determine whether the death was more likely than not to have been due to problems in care. It may be appropriate to cross-reference those outputs with the processes for assessing structured judgement reviews, and if appropriate to include those outputs here.\n\nTrusts are able to include monthly totals of reviewed deaths that were in each category of the Likert scale 1 to 6, used by PRISM (as shown on the data sheet 4) (PRISM, Medical Record Review, Dr Helen Hogan, January 2014). Alternatively, the 1 to 6 categories can be either left blank or edited as appropriate, for example to include another scale such as the 5 point scale used by the National Confidential Enquiry into Patient Outcome and Death (NCEPOD)."]
[null,"Recording data on LeDeR reviews:"]
[null,4,"Total Number of Deaths in scope","This must include all adult inpatient deaths for patients with identified learning disabilities. The total number of deaths in scope defined in this field must be used in all subsequent relevant fields. If a post-discharge period is being included in scope, (eg deaths within 30 days of discharge) then the death should be counted in the month where the death actually occurred rather than time of admittance or discharge. \n\n"]
[null,5,"Total Deaths Reviewed Through the LeDeR Methodology","Formally, the LeDeR review methodology should be applied to all of the deaths shown as 'in scope'. You should record the total number of deaths reviewed here."]
[null,6,"Total Number of deaths considered more likely than not to have been due to problems in care.","Record the total number of deaths for which review evidence leads to a conclusion that it is more likely than not that the death was potentially avoidable. This will require that a degree of judgement is applied to the outputs of the LeDeR review, and it may be appropriate to cross-reference these outputs with the processes for assessing structured judgement reviews"]
[]
[null,"How to update the dashboard"]
[null,"To update this dashboard - enter your data on the \"Data\" worksheet. The dashboard sheet is automatically updated. \n\nTo update the dashboard with new data:\n1. Enter data for appropriate month(s) in the Data tab. Note that the columns headed 1,2,3,4,5,6 refer to the scale proposed by PRISM and these are optional fields. The dashboard will still function correctly if these fields are left blank. \n- In the first 3 columns enter the data for your structured judgement reviews (number of deaths in scope, numbers reviewed, and numbers deemed more likely than not to be due to problems in care )\n- For learning disabilities patients, enter the number of deaths in scope, numbers reviewed under the LeDeR methodology, and numbers deemed more likely than not to be due to problems in care\n\n2. Change the month and year on the Front Sheet tab to the most recent month of data. \n3. Change the data range on the time series charts as required by using the interactive dropdowns on the Dashboard tab (eg cell V4). Note that the time series charts are not linked to the front sheet selection and are driven entirely by the dropdowns. \n"]

{"sheet":"Trust Dashboard","index":2,"n_rows":53,"n_cols":31,"rows_kept":53,"cut":false,"hidden":false,"merged":[[5,1,7,14],[13,3,13,4],[13,8,13,9],[13,13,13,14],[15,3,15,4],[15,13,15,14],[9,1,9,4],[9,11,9,14],[11,3,11,4],[11,8,11,9],[11,13,11,14],[36,1,38,14],[9,6,9,9],[23,1,23,30],[26,1,26,4],[26,6,26,9],[26,11,26,14],[26,16,26,19],[21,3,21,4],[21,8,21,9],[21,13,21,14],[25,1,25,4],[25,6,25,9],[25,11,25,14],[25,16,25,19],[25,27,25,29],[15,8,15,9],[17,3,17,4],[17,8,17,9],[17,13,17,14],[19,3,19,4],[19,8,19,9],[19,13,19,14],[46,8,46,9],[46,13,46,14],[40,1,40,4],[40,6,40,9],[40,11,40,14],[42,3,42,4],[42,8,42,9],[42,13,42,14],[1,1,1,30],[3,1,3,30],[52,3,52,4],[52,8,52,9],[52,13,52,14],[34,1,34,30],[48,3,48,4],[48,8,48,9],[48,13,48,14],[50,3,50,4],[50,8,50,9],[50,13,50,14],[44,3,44,4],[44,8,44,9],[44,13,44,14],[46,3,46,4]]}
[null,null,null,null,null,null,{"$f":"CONCATENATE(Data!F1, \":  Learning from Deaths Dashboard -  \", Data!F3, \" \", Data!F4 )","v":"NHS Anytown Foundation Trust:  Learning from Deaths Dashboard -  September 2017-18"}]
[null,"Description:\nThe suggested dashboard is a tool to aid the systematic recording of deaths and learning from care provided by NHS Trusts. Trusts are encouraged to use this to record relevant incidents of mortality, number of deaths reviewed and cases from which lessons can be learnt to improve care. "]
[]
[null,"Summary of total number of deaths and total number of cases reviewed under the Structured Judgement Review Methodology"]
[]
[null,"Total Number of Deaths, Deaths Reviewed and Deaths Deemed more likely than not due to problems in care (does not include patients with identified learning disabilities)",null,null,null,null,null,null,null,null,null,null,null,null,null,null,"Time Series:",null,"Start date","2017-18",null,"Q1",null,null,"End date",null,null,"2018-19",null,"Q2"]
[]
[]
[]
[null,"Total Number of Deaths in Scope  ",null,null,null,null,"Total Deaths Reviewed",null,null,null,null,"Total Number of deaths considered more likely than not due to problems in care           \nPRISM Score<=3 or equivalent measure"]
[]
[null,"This Month",null,"Last Month",null,null,"This Month",null,"Last Month",null,null,"This Month",null,"Last Month"]
[]
[null,{"$f":"Workings!E8","v":454},null,{"$f":"Workings!E32","v":523},null,null,{"$f":"Workings!E9","v":339},null,{"$f":"Workings!E33","v":298},null,null,{"$f":"Workings!E10","v":14},null,{"$f":"Workings!E34","v":20}]
[]
[null,"This Quarter (QTD)",null,"Last Quarter",null,null,"This Quarter (QTD)",null,"Last Quarter",null,null,"This Quarter (QTD)",null,"Last Quarter"]
[]
[null,{"$f":"Workings!E44","v":1436},null,{"$f":"Workings!E68","v":1509},null,null,{"$f":"Workings!E45","v":939},null,{"$f":"Workings!E69","v":1053},null,null,{"$f":"Workings!E46","v":50},null,{"$f":"Workings!E70","v":54}]
[]
[null,"This Year (YTD)",null,"Last Year",null,null,"This Year (YTD)",null,"Last Year",null,null,"This Year (YTD)",null,"Last Year"]
[]
[null,{"$f":"Workings!E80","v":6069},null,{"$f":"Workings!E104","v":0},null,null,{"$f":"Workings!E81","v":3991},null,{"$f":"Workings!E105","v":0},null,null,{"$f":"Workings!E82","v":227},null,{"$f":"Workings!E106","v":0}]
[]
[null,"Total Deaths Reviewed, categorised by PRISM Score"]
[]
[null,"Score 1",null,null,null,null,"Score 2",null,null,null,null,"Score 3",null,null,null,null,"Score 4",null,null,null,null,"Score 5",null,null,null,null,null,"Score 6"]
[null,"Definitely avoidable",null,null,null,null,"Strong evidence of avoidability",null,null,null,null,"Probably avoidable (more than 50:50)",null,null,null,null,"Probably avoidable but not very likely",null,null,null,null,"Slight evidence of avoidability",null,null,null,null,null,"Definitely not avoidable"]
[]
[null,"This Month",null,{"$f":"Workings!E11","v":0},{"$f":"IFERROR(D29/SUM($D29, $I29,$N29,$S29,$Y29,$AD29), \"-\")","v":0},null,"This Month",null,{"$f":"Workings!E12","v":4},{"$f":"IFERROR(I29/SUM($D29, $I29,$N29,$S29,$Y29,$AD29), \"-\")","v":1.1799410029498525E-2},null,"This Month",null,{"$f":"Workings!E13","v":10},{"$f":"IFERROR(N29/SUM($D29, $I29,$N29,$S29,$Y29,$AD29), \"-\")","v":2.9498525073746312E-2},null,"This Month",null,{"$f":"Workings!E14","v":33},{"$f":"IFERROR(S29/SUM($D29, $I29,$N29,$S29,$Y29,$AD29), \"-\")","v":9.7345132743362831E-2},null,"This Month",null,null,{"$f":"Workings!E15","v":65},{"$f":"IFERROR(Y29/SUM($D29, $I29,$N29,$S29,$Y29,$AD29), \"-\")","v":0.19174041297935104},null,"This Month",null,{"$f":"Workings!E16","v":227},{"$f":"IFERROR(AD29/SUM($D29, $I29,$N29,$S29,$Y29,$AD29), \"-\")","v":0.6696165191740413}]
[null,null,null,null,null,null,null,null,null,null,null,null,null,7]
[null,"This Quarter (QTD)",null,{"$f":"Workings!E47","v":5},{"$f":"IFERROR(D31/SUM($D31, $I31,$N31,$S31,$Y31,$AD31), \"-\")","v":5.3248136315228968E-3},null,"This Quarter (QTD)",null,{"$f":"Workings!E48","v":14},{"$f":"IFERROR(I31/SUM($D31, $I31,$N31,$S31,$Y31,$AD31), \"-\")","v":1.4909478168264111E-2},null,"This Quarter (QTD)",null,{"$f":"Workings!E49","v":31},{"$f":"IFERROR(N31/SUM($D31, $I31,$N31,$S31,$Y31,$AD31), \"-\")","v":3.301384451544196E-2},null,"This Quarter (QTD)",null,{"$f":"Workings!E50","v":90},{"$f":"IFERROR(S31/SUM($D31, $I31,$N31,$S31,$Y31,$AD31), \"-\")","v":9.5846645367412137E-2},null,"This Quarter (QTD)",null,null,{"$f":"Workings!E51","v":178},{"$f":"IFERROR(Y31/SUM($D31, $I31,$N31,$S31,$Y31,$AD31), \"-\")","v":0.18956336528221512},null,"This Quarter (QTD)",null,{"$f":"Workings!E52","v":621},{"$f":"IFERROR(AD31/SUM($D31, $I31,$N31,$S31,$Y31,$AD31), \"-\")","v":0.66134185303514381}]
[]
[null,"This Year (YTD)",null,{"$f":"Workings!E83","v":30},{"$f":"IFERROR(D33/SUM($D33, $I33,$N33,$S33,$Y33,$AD33), \"-\")","v":7.5169130543723374E-3},null,"This Year (YTD)",null,{"$f":"Workings!E84","v":65},{"$f":"IFERROR(I33/SUM($D33, $I33,$N33,$S33,$Y33,$AD33), \"-\")","v":1.6286644951140065E-2},null,"This Year (YTD)",null,{"$f":"Workings!E85","v":132},{"$f":"IFERROR(N33/SUM($D33, $I33,$N33,$S33,$Y33,$AD33), \"-\")","v":3.3074417439238286E-2},null,"This Year (YTD)",null,{"$f":"Workings!E86","v":378},{"$f":"IFERROR(S33/SUM($D33, $I33,$N33,$S33,$Y33,$AD33), \"-\")","v":9.4713104485091459E-2},null,"This Year (YTD)",null,null,{"$f":"Workings!E87","v":754},{"$f":"IFERROR(Y33/SUM($D33, $I33,$N33,$S33,$Y33,$AD33), \"-\")","v":0.18892508143322476},null,"This Year (YTD)",null,{"$f":"Workings!E88","v":2632},{"$f":"IFERROR(AD33/SUM($D33, $I33,$N33,$S33,$Y33,$AD33), \"-\")","v":0.65948383863693305}]
[]
[null,"\nSummary of total number of learning disability deaths and total number reviewed under the LeDeR methodology"]
[]
[null,"Total Number of Deaths, Deaths Reviewed and Deaths Deemed more likely than not due to problems in care for patients with identified learning disabilities",null,null,null,null,null,null,null,null,null,null,null,null,null,null,"Time Series:",null,"Start date","2017-18",null,"Q1",null,null,"End date",null,null,"2018-19",null,"Q1"]
[]
[]
[]
[null,"Total Number of Deaths in scope  ",null,null,null,null,"Total Deaths Reviewed Through the LeDeR Methodology (or equivalent)",null,null,null,null,"Total Number of deaths considered more likely than not due to problems in care              "]
[]
[null,"This Month",null,"Last Month",null,null,"This Month",null,"Last Month",null,null,"This Month",null,"Last Month"]
[]
[null,{"$f":"Workings!E17","v":10},null,{"$f":"Workings!E41","v":2},null,null,{"$f":"Workings!E18","v":10},null,{"$f":"Workings!E42","v":2},null,null,{"$f":"Workings!E19","v":2},null,{"$f":"Workings!E43","v":0}]
[]
[null,"This Quarter (QTD)",null,"Last Quarter",null,null,"This Quarter (QTD)",null,"Last Quarter",null,null,"This Quarter (QTD)",null,"Last Quarter"]
[]
[null,{"$f":"Workings!E53","v":16},null,{"$f":"Workings!E77","v":24},null,null,{"$f":"Workings!E54","v":16},null,{"$f":"Workings!E78","v":24},null,null,{"$f":"Workings!E55","v":3},null,{"$f":"Workings!E79","v":4}]
[]
[null,"This Year (YTD)",null,"Last Year",null,null,"This Year (YTD)",null,"Last Year",null,null,"This Year (YTD)",null,"Last Year"]
[]
[null,{"$f":"Workings!E89","v":75},null,{"$f":"Workings!E113","v":0},null,null,{"$f":"Workings!E90","v":75},null,{"$f":"Workings!E114","v":0},null,null,{"$f":"Workings!E91","v":19},null,{"$f":"Workings!E115","v":0}]

{"sheet":"Trust SJR Comparison","index":3,"n_rows":12,"n_cols":22,"rows_kept":12,"cut":false,"hidden":true,"merged":[[1,2,1,22],[3,4,3,6],[3,16,3,21],[3,9,3,14]]}
[null,null,null,null,{"$f":"CONCATENATE(Data!F1, \":  Learning from Deaths Dashboard -  \", Data!F3, \" \", Data!F4 )","v":"NHS Anytown Foundation Trust:  Learning from Deaths Dashboard -  September 2017-18"}]
[null,null,"Description:\nSmall differences in review practices can mean that comparisons between Trusts do not give a fair picture. It is open to Trusts to use data from other organisations to consider whether their own review processes are as comprehensive as others. Trusts are able to select their own peers or comparator organisations, and can use this locally to challenge themselves if their findings are very different. There is no central mechanism to provide you with data from other Trusts – this material is for local use and might be drawn, for example, from the dashboards published by other organisations\n"]
[]
[null,null,null,null,"Total Deaths in scope",null,null,null,null,"Total Deaths Reviewed",null,null,null,null,null,null,"Total number of  deaths considered to have more than a 50% chance of having been avoidable\n(RCP <= 3)"]
[]
[null,"Organisation Name",null,null,"This Month","This Quarter (QTD)","This Year (YTD)",null,null,"This Month","This Month %","This Quarter (QTD)","This Quarter % (QTD)","This Year (YTD)","This Year % (YTD)",null,"This Month","This Month %","This Quarter (QTD)","This Quarter % (QTD)","This Year (YTD)","This Year % (YTD)"]
[]
[null,{"$f":"Data!F1","v":"NHS Anytown Foundation Trust"},null,null,{"$f":"Workings!E8","v":454},{"$f":"Workings!E44","v":1436},{"$f":"Workings!E80","v":6069},null,null,{"$f":"Workings!E9","v":339},{"$f":"IFERROR(J8/E8, \"-\")","v":0.74669603524229078},{"$f":"Workings!E45","v":939},{"$f":"IFERROR(L8/F8, \"-\")","v":0.65389972144846797},{"$f":"Workings!E81","v":3991},{"$f":"IFERROR(N8/G8, \"-\")","v":0.65760421815785142},null,{"$f":"Workings!E10","v":14},{"$f":"IFERROR(Q8/E8, \"-\")","v":3.0837004405286344E-2},{"$f":"Workings!E46","v":50},{"$f":"IFERROR(S8/F8, \"-\")","v":3.4818941504178275E-2},{"$f":"Workings!E82","v":227},{"$f":"IFERROR(U8/G8, \"-\")","v":3.7403196572746746E-2}]
[null,{"$f":"IF(ISBLANK(Data!$S$6),\"-\",Data!S6)","v":"Comparison trust 1"},null,null,{"$f":"IF(ISBLANK(Data!$S$6),\"-\",Workings!E20)","v":376},{"$f":"IF(ISBLANK(Data!$S$6),\"-\",Workings!E56)","v":1035},{"$f":"IF(ISBLANK(Data!$S$6),\"-\",Workings!E92)","v":4057},null,null,{"$f":"IF(ISBLANK(Data!$S$6),\"-\",Workings!E21)","v":266},{"$f":"IFERROR(J9/E9, \"-\")","v":0.70744680851063835},{"$f":"IF(ISBLANK(Data!$S$6),\"-\",Workings!E57)","v":719},{"$f":"IFERROR(L9/F9, \"-\")","v":0.69468599033816425},{"$f":"IF(ISBLANK(Data!$S$6),\"-\",Workings!E93)","v":2363},{"$f":"IFERROR(N9/G9, \"-\")","v":0.58245008627064332},null,{"$f":"IF(ISBLANK(Data!$S$6),\"-\",Workings!E22)","v":40},{"$f":"IFERROR(Q9/E9, \"-\")","v":0.10638297872340426},{"$f":"IF(ISBLANK(Data!$S$6),\"-\",Workings!E58)","v":106},{"$f":"IFERROR(S9/F9, \"-\")","v":0.10241545893719807},{"$f":"IF(ISBLANK(Data!$S$6),\"-\",Workings!E94)","v":343},{"$f":"IFERROR(U9/G9, \"-\")","v":8.4545230465861473E-2}]
[null,{"$f":"IF(ISBLANK(Data!$V$6),\"-\",Data!V6)","v":"Comparison trust 2"},null,null,{"$f":"IF(ISBLANK(Data!$V$6),\"-\",Workings!E23)","v":396},{"$f":"IF(ISBLANK(Data!$V$6),\"-\",Workings!E59)","v":1087},{"$f":"IF(ISBLANK(Data!$V$6),\"-\",Workings!E95)","v":4186},null,null,{"$f":"IF(ISBLANK(Data!$V$6),\"-\",Workings!E24)","v":326},{"$f":"IFERROR(J10/E10, \"-\")","v":0.8232323232323232},{"$f":"IF(ISBLANK(Data!$V$6),\"-\",Workings!E60)","v":625},0.57497700091996318,{"$f":"IF(ISBLANK(Data!$V$6),\"-\",Workings!E96)","v":2183},{"$f":"IFERROR(N10/G10, \"-\")","v":0.52150023889154329},null,{"$f":"IF(ISBLANK(Data!$V$6),\"-\",Workings!E25)","v":42},0.10606060606060606,{"$f":"IF(ISBLANK(Data!$V$6),\"-\",Workings!E61)","v":86},7.9116835326586935E-2,{"$f":"IF(ISBLANK(Data!$V$6),\"-\",Workings!E97)","v":302},7.2145246058289536E-2]
[null,{"$f":"IF(ISBLANK(Data!$Y$6),\"-\",Data!Y6)","v":"Comparison trust 3"},null,null,{"$f":"IF(ISBLANK(Data!$Y$6),\"-\",Workings!E26)","v":378},{"$f":"IF(ISBLANK(Data!$Y$6),\"-\",Workings!E62)","v":1038},{"$f":"IF(ISBLANK(Data!$Y$6),\"-\",Workings!E98)","v":4073},null,null,{"$f":"IF(ISBLANK(Data!$Y$6),\"-\",Workings!E27)","v":325},{"$f":"IFERROR(J11/E11, \"-\")","v":0.85978835978835977},{"$f":"IF(ISBLANK(Data!$Y$6),\"-\",Workings!E63)","v":598},0.5761078998073218,{"$f":"IF(ISBLANK(Data!$Y$6),\"-\",Workings!E99)","v":1773},{"$f":"IFERROR(N11/G11, \"-\")","v":0.43530567149521238},null,{"$f":"IF(ISBLANK(Data!$Y$6),\"-\",Workings!E28)","v":36},9.5238095238095233E-2,{"$f":"IF(ISBLANK(Data!$Y$6),\"-\",Workings!E64)","v":83},7.9961464354527945E-2,{"$f":"IF(ISBLANK(Data!$Y$6),\"-\",Workings!E100)","v":269},6.6044684507733861E-2]
[null,{"$f":"IF(ISBLANK(Data!$AB$6),\"-\",Data!AB6)","v":"-"},null,null,{"$f":"IF(ISBLANK(Data!$AB$6),\"-\",Workings!E29)","v":"-"},{"$f":"IF(ISBLANK(Data!$AB$6),\"-\",Workings!E65)","v":"-"},{"$f":"IF(ISBLANK(Data!$AB$6),\"-\",Workings!E101)","v":"-"},null,null,{"$f":"IF(ISBLANK(Data!$AB$6),\"-\",Workings!E30)","v":"-"},{"$f":"IFERROR(J12/E12, \"-\")","v":"-"},{"$f":"IF(ISBLANK(Data!$AB$6),\"-\",Workings!E66)","v":"-"},"-",{"$f":"IF(ISBLANK(Data!$AB$6),\"-\",Workings!E102)","v":"-"},{"$f":"IFERROR(N12/G12, \"-\")","v":"-"},null,{"$f":"IF(ISBLANK(Data!$AB$6),\"-\",Workings!E31)","v":"-"},{"$f":"IFERROR(Q12/E12, \"-\")","v":"-"},{"$f":"IF(ISBLANK(Data!$AB$6),\"-\",Workings!E67)","v":"-"},{"$f":"IFERROR(S12/F12, \"-\")","v":"-"},{"$f":"IF(ISBLANK(Data!$AB$6),\"-\",Workings!E103)","v":"-"},{"$f":"IFERROR(U12/G12, \"-\")","v":"-"}]

{"sheet":"Workings","index":4,"n_rows":115,"n_cols":34,"rows_kept":115,"cut":false,"hidden":true,"merged":[]}
["WORKINGS (do not delete!)",null,null,null,null,null,null,null,null,null,null,null,null,null,null,null,null,null,null,null,"FOR TIMESERIES CHART (also powered by named ranges)",null,null,null,null,null,null,null,null,"FOR TIMESERIES CHART (also powered by named ranges)"]
[null,null,null,null,null,null,null,null,null,null,null,null,null,null,null,null,null,null,null,null,"time series start","code",null,"time series end","code",null,null,null,null,"time series start","code",null,"time series end","code"]
[null,"year",{"$f":"Data!F4","v":"2017-18"},null,null,null,null,null,null,null,null,null,null,null,null,null,null,null,null,null,{"$f":"'Trust Dashboard'!V6&\" \"&'Trust Dashboard'!T6","v":"Q1 2017-18"},{"$f":"VLOOKUP(U3, U8:V127, 2, 0)","v":1},null,{"$f":"'Trust Dashboard'!AD6&\" \"&'Trust Dashboard'!AB6","v":"Q2 2018-19"},{"$f":"VLOOKUP(X3, U8:V127, 2, 0)","v":6},null,null,null,null,{"$f":"'Trust Dashboard'!$V$37&\" \"&'Trust Dashboard'!$T$37","v":"Q1 2017-18"},{"$f":"VLOOKUP(AD3, U8:V47, 2, 0)","v":1},null,{"$f":"'Trust Dashboard'!$AD$37&\" \"&'Trust Dashboard'!$AB$37","v":"Q1 2018-19"},{"$f":"VLOOKUP(AG3, U8:V127, 2, 0)","v":5}]
[null,"month",{"$f":"Data!F3","v":"September"}]
[null,"lookup",{"$f":"C3&C4","v":"2017-18September"}]
[null,null,null,null,null,null,null,"drop downs",null,null,null,"Quarter table for time series",null,null,null,null,null,null,null,null,"time series lookups",null,null,null,"time series chart data table",null,null,null,null,"time series chart data table"]
[null,"ind_0","ind","data col","lookup",null,null,"year","month","quarter",null,"Quarter","Total Deaths (not LD)","Total Deaths Reviewed","Deaths Avoidable > 50%","LD Deaths","LD Deaths Reviewed","LD Deaths Avoidable > 50%",null,null,"date","lookup code",null,null,"date","deaths","reviewed","More likely than not due to problems in care",null,"date","deaths","reviewed","More likely than not due to problems in care"]
["this month",null,"Total Deaths",4,{"$f":"VLOOKUP($C$5, Data!$D$8:$DJ$127, Workings!$D8, 0)","v":454},null,null,"2017-18","April","Q1",null,"Q1 2017-18",{"$f":"VLOOKUP($L8, Data!$B$8:$BB$127, 42, 0)","v":1509},{"$f":"VLOOKUP($L8, Data!$B$8:$BB$127, 43, 0)","v":1053},{"$f":"VLOOKUP($L8, Data!$B$8:$BB$127, 44, 0)","v":54},{"$f":"VLOOKUP($L8, Data!$B$8:$BB$127, 51, 0)","v":24},{"$f":"VLOOKUP($L8, Data!$B$8:$BB$127, 52, 0)","v":24},{"$f":"VLOOKUP($L8, Data!$B$8:$BB$127, 53, 0)","v":4},"Q1 2017-18",null,"Q1 2017-18",1,null,null,{"$f":"IF(   AND(V8 >= $V$3, V8<=$Y$3), S8, \"\")","v":"Q1 2017-18"},{"$f":"IF(IF(   AND(V8 >= $V$3, V8<=$Y$3), M8, NA() ) = 0, NA(), IF(   AND(V8 >= $V$3, V8<=$Y$3), M8, NA() ))","v":1509},{"$f":"IF(IF(   AND(V8 >= $V$3, V8<=$Y$3), N8, NA() ) = 0, NA(), IF(   AND(V8 >= $V$3, V8<=$Y$3), N8, NA() ))","v":1053},{"$f":"IF(IF(   AND(V8 >= $V$3, V8<=$Y$3), O8, NA() ) = 0, NA(), IF(   AND(V8 >= $V$3, V8<=$Y$3), O8, NA() ))","v":54},null,{"$f":"IF(   AND(V8 >= $AE$3, V8<=$AH$3), S8, \"\")","v":"Q1 2017-18"},{"$f":"IF(IF(   AND(V8 >= $AE$3, V8<=$AH$3), P8, NA()) = 0, NA(), IF(   AND(V8 >= $AE$3, V8<=$AH$3), P8, NA()))","v":24},{"$f":"IF(IF(   AND(V8 >= $AE$3, V8<=$AH$3), Q8, NA()) = 0, NA(), IF(   AND(V8 >= $AE$3, V8<=$AH$3), Q8, NA()))","v":24},{"$f":"IF(IF(   AND(V8 >= $AE$3, V8<=$AH$3), R8, NA()) = 0, NA(), IF(   AND(V8 >= $AE$3, V8<=$AH$3), R8, NA()))","v":4}]
[null,null,"Total Deaths Reviewed",5,{"$f":"VLOOKUP($C$5, Data!$D$8:$DJ$127, Workings!$D9, 0)","v":339},null,null,"2018-19","May","Q2",null,"Q2 2017-18",{"$f":"VLOOKUP($L9, Data!$B$8:$BB$127, 42, 0)","v":1436},{"$f":"VLOOKUP($L9, Data!$B$8:$BB$127, 43, 0)","v":939},{"$f":"VLOOKUP($L9, Data!$B$8:$BB$127, 44, 0)","v":50},{"$f":"VLOOKUP($L9, Data!$B$8:$BB$127, 51, 0)","v":16},{"$f":"VLOOKUP($L9, Data!$B$8:$BB$127, 52, 0)","v":16},{"$f":"VLOOKUP($L9, Data!$B$8:$BB$127, 53, 0)","v":3},"Q2",null,"Q2 2017-18",2,null,null,{"$f":"IF(   AND(V9 >= $V$3, V9<=$Y$3), S9, \"\")","v":"Q2"},{"$f":"IF(IF(   AND(V9 >= $V$3, V9<=$Y$3), M9, NA() ) = 0, NA(), IF(   AND(V9 >= $V$3, V9<=$Y$3), M9, NA() ))","v":1436},{"$f":"IF(IF(   AND(V9 >= $V$3, V9<=$Y$3), N9, NA() ) = 0, NA(), IF(   AND(V9 >= $V$3, V9<=$Y$3), N9, NA() ))","v":939},{"$f":"IF(IF(   AND(V9 >= $V$3, V9<=$Y$3), O9, NA() ) = 0, NA(), IF(   AND(V9 >= $V$3, V9<=$Y$3), O9, NA() ))","v":50},null,{"$f":"IF(   AND(V9 >= $AE$3, V9<=$AH$3), S9, \"\")","v":"Q2"},{"$f":"IF(IF(   AND(V9 >= $AE$3, V9<=$AH$3), P9, NA()) = 0, NA(), IF(   AND(V9 >= $AE$3, V9<=$AH$3), P9, NA()))","v":16},{"$f":"IF(IF(   AND(V9 >= $AE$3, V9<=$AH$3), Q9, NA()) = 0, NA(), IF(   AND(V9 >= $AE$3, V9<=$AH$3), Q9, NA()))","v":16},{"$f":"IF(IF(   AND(V9 >= $AE$3, V9<=$AH$3), R9, NA()) = 0, NA(), IF(   AND(V9 >= $AE$3, V9<=$AH$3), R9, NA()))","v":3}]
[null,null,"Deaths Avoidable",6,{"$f":"VLOOKUP($C$5, Data!$D$8:$DJ$127, Workings!$D10, 0)","v":14},null,null,"2019-20","June","Q3",null,"Q3 2017-18",{"$f":"VLOOKUP($L10, Data!$B$8:$BB$127, 42, 0)","v":1565},{"$f":"VLOOKUP($L10, Data!$B$8:$BB$127, 43, 0)","v":979},{"$f":"VLOOKUP($L10, Data!$B$8:$BB$127, 44, 0)","v":67},{"$f":"VLOOKUP($L10, Data!$B$8:$BB$127, 51, 0)","v":11},{"$f":"VLOOKUP($L10, Data!$B$8:$BB$127, 52, 0)","v":11},{"$f":"VLOOKUP($L10, Data!$B$8:$BB$127, 53, 0)","v":3},"Q3",null,"Q3 2017-18",3,null,null,"Q3",1565,979,67,null,"Q3",11,11,3]
[null,null,"RCP1",7,{"$f":"VLOOKUP($C$5, Data!$D$8:$DJ$127, Workings!$D11, 0)","v":0},null,null,"2020-21","July","Q4",null,"Q4 2017-18",{"$f":"VLOOKUP($L11, Data!$B$8:$BB$127, 42, 0)","v":1559},{"$f":"VLOOKUP($L11, Data!$B$8:$BB$127, 43, 0)","v":1020},{"$f":"VLOOKUP($L11, Data!$B$8:$BB$127, 44, 0)","v":56},{"$f":"VLOOKUP($L11, Data!$B$8:$BB$127, 51, 0)","v":24},{"$f":"VLOOKUP($L11, Data!$B$8:$BB$127, 52, 0)","v":24},{"$f":"VLOOKUP($L11, Data!$B$8:$BB$127, 53, 0)","v":9},"Q4",null,"Q4 2017-18",4,null,null,"Q4",1559,1020,56,null,"Q4",24,24,9]
[null,null,"RCP2",8,{"$f":"VLOOKUP($C$5, Data!$D$8:$DJ$127, Workings!$D12, 0)","v":4},null,null,"2021-22","August",null,null,"Q1 2018-19",{"$f":"VLOOKUP($L12, Data!$B$8:$BB$127, 42, 0)","v":1456},{"$f":"VLOOKUP($L12, Data!$B$8:$BB$127, 43, 0)","v":942},{"$f":"VLOOKUP($L12, Data!$B$8:$BB$127, 44, 0)","v":44},{"$f":"VLOOKUP($L12, Data!$B$8:$BB$127, 51, 0)","v":29},{"$f":"VLOOKUP($L12, Data!$B$8:$BB$127, 52, 0)","v":29},{"$f":"VLOOKUP($L12, Data!$B$8:$BB$127, 53, 0)","v":6},"Q1 2018-19",null,"Q1 2018-19",5,null,null,"Q1 2018-19",1456,942,44,null,"Q1 2018-19",29,29,6]
[null,null,"RCP3",9,{"$f":"VLOOKUP($C$5, Data!$D$8:$DJ$127, Workings!$D13, 0)","v":10},null,null,"2022-23","September",null,null,"Q2 2018-19",{"$f":"VLOOKUP($L13, Data!$B$8:$BB$127, 42, 0)","v":1487},{"$f":"VLOOKUP($L13, Data!$B$8:$BB$127, 43, 0)","v":1029},{"$f":"VLOOKUP($L13, Data!$B$8:$BB$127, 44, 0)","v":55},{"$f":"VLOOKUP($L13, Data!$B$8:$BB$127, 51, 0)","v":15},{"$f":"VLOOKUP($L13, Data!$B$8:$BB$127, 52, 0)","v":15},{"$f":"VLOOKUP($L13, Data!$B$8:$BB$127, 53, 0)","v":2},"Q2",null,"Q2 2018-19",6,null,null,"Q2",1487,1029,55,null,"",{"$error":"#N/A"},{"$error":"#N/A"},{"$error":"#N/A"}]
[null,null,"RCP4",10,{"$f":"VLOOKUP($C$5, Data!$D$8:$DJ$127, Workings!$D14, 0)","v":33},null,null,"2023-24","October",null,null,"Q3 2018-19",{"$f":"VLOOKUP($L14, Data!$B$8:$BB$127, 42, 0)","v":0},{"$f":"VLOOKUP($L14, Data!$B$8:$BB$127, 43, 0)","v":0},{"$f":"VLOOKUP($L14, Data!$B$8:$BB$127, 44, 0)","v":0},{"$f":"VLOOKUP($L14, Data!$B$8:$BB$127, 51, 0)","v":0},{"$f":"VLOOKUP($L14, Data!$B$8:$BB$127, 52, 0)","v":0},{"$f":"VLOOKUP($L14, Data!$B$8:$BB$127, 53, 0)","v":0},"Q3",null,"Q3 2018-19",7,null,null,"",{"$error":"#N/A"},{"$error":"#N/A"},{"$error":"#N/A"},null,"",{"$error":"#N/A"},{"$error":"#N/A"},{"$error":"#N/A"}]
[null,null,"RCP5",11,{"$f":"VLOOKUP($C$5, Data!$D$8:$DJ$127, Workings!$D15, 0)","v":65},null,null,"2024-25","November",null,null,"Q4 2018-19",{"$f":"VLOOKUP($L15, Data!$B$8:$BB$127, 42, 0)","v":0},{"$f":"VLOOKUP($L15, Data!$B$8:$BB$127, 43, 0)","v":0},{"$f":"VLOOKUP($L15, Data!$B$8:$BB$127, 44, 0)","v":0},{"$f":"VLOOKUP($L15, Data!$B$8:$BB$127, 51, 0)","v":0},{"$f":"VLOOKUP($L15, Data!$B$8:$BB$127, 52, 0)","v":0},{"$f":"VLOOKUP($L15, Data!$B$8:$BB$127, 53, 0)","v":0},"Q4",null,"Q4 2018-19",8,null,null,"",{"$error":"#N/A"},{"$error":"#N/A"},{"$error":"#N/A"},null,"",{"$error":"#N/A"},{"$error":"#N/A"},{"$error":"#N/A"}]
[null,null,"RCP6",12,{"$f":"VLOOKUP($C$5, Data!$D$8:$DJ$127, Workings!$D16, 0)","v":227},null,null,"2025-26","December",null,null,"Q1 2019-20",{"$f":"VLOOKUP($L16, Data!$B$8:$BB$127, 42, 0)","v":0},{"$f":"VLOOKUP($L16, Data!$B$8:$BB$127, 43, 0)","v":0},{"$f":"VLOOKUP($L16, Data!$B$8:$BB$127, 44, 0)","v":0},{"$f":"VLOOKUP($L16, Data!$B$8:$BB$127, 51, 0)","v":0},{"$f":"VLOOKUP($L16, Data!$B$8:$BB$127, 52, 0)","v":0},{"$f":"VLOOKUP($L16, Data!$B$8:$BB$127, 53, 0)","v":0},"Q1 2019-20",null,"Q1 2019-20",9,null,null,"",{"$error":"#N/A"},{"$error":"#N/A"},{"$error":"#N/A"},null,"",{"$error":"#N/A"},{"$error":"#N/A"},{"$error":"#N/A"}]
[null,null,"LD Total Deaths",13,{"$f":"VLOOKUP($C$5, Data!$D$8:$DJ$127, Workings!$D17, 0)","v":10},null,null,"2026-27","January",null,null,"Q2 2019-20",{"$f":"VLOOKUP($L17, Data!$B$8:$BB$127, 42, 0)","v":0},{"$f":"VLOOKUP($L17, Data!$B$8:$BB$127, 43, 0)","v":0},{"$f":"VLOOKUP($L17, Data!$B$8:$BB$127, 44, 0)","v":0},{"$f":"VLOOKUP($L17, Data!$B$8:$BB$127, 51, 0)","v":0},{"$f":"VLOOKUP($L17, Data!$B$8:$BB$127, 52, 0)","v":0},{"$f":"VLOOKUP($L17, Data!$B$8:$BB$127, 53, 0)","v":0},"Q2",null,"Q2 2019-20",10,null,null,"",{"$error":"#N/A"},{"$error":"#N/A"},{"$error":"#N/A"},null,"",{"$error":"#N/A"},{"$error":"#N/A"},{"$error":"#N/A"}]
[null,null,"LD Reviewed",14,{"$f":"VLOOKUP($C$5, Data!$D$8:$DJ$127, Workings!$D18, 0)","v":10},null,null,null,"February",null,null,"Q3 2019-20",{"$f":"VLOOKUP($L18, Data!$B$8:$BB$127, 42, 0)","v":0},{"$f":"VLOOKUP($L18, Data!$B$8:$BB$127, 43, 0)","v":0},{"$f":"VLOOKUP($L18, Data!$B$8:$BB$127, 44, 0)","v":0},{"$f":"VLOOKUP($L18, Data!$B$8:$BB$127, 51, 0)","v":0},{"$f":"VLOOKUP($L18, Data!$B$8:$BB$127, 52, 0)","v":0},{"$f":"VLOOKUP($L18, Data!$B$8:$BB$127, 53, 0)","v":0},"Q3",null,"Q3 2019-20",11,null,null,"",{"$error":"#N/A"},{"$error":"#N/A"},{"$error":"#N/A"},null,"",{"$error":"#N/A"},{"$error":"#N/A"},{"$error":"#N/A"}]
[null,null,"LD Avoidable",15,{"$f":"VLOOKUP($C$5, Data!$D$8:$DJ$127, Workings!$D19, 0)","v":2},null,null,null,"March",null,null,"Q4 2019-20",{"$f":"VLOOKUP($L19, Data!$B$8:$BB$127, 42, 0)","v":0},{"$f":"VLOOKUP($L19, Data!$B$8:$BB$127, 43, 0)","v":0},{"$f":"VLOOKUP($L19, Data!$B$8:$BB$127, 44, 0)","v":0},{"$f":"VLOOKUP($L19, Data!$B$8:$BB$127, 51, 0)","v":0},{"$f":"VLOOKUP($L19, Data!$B$8:$BB$127, 52, 0)","v":0},{"$f":"VLOOKUP($L19, Data!$B$8:$BB$127, 53, 0)","v":0},"Q4",null,"Q4 2019-20",12,null,null,"",{"$error":"#N/A"},{"$error":"#N/A"},{"$error":"#N/A"},null,"",{"$error":"#N/A"},{"$error":"#N/A"},{"$error":"#N/A"}]
[null,"Comparison trust 1","Total Deaths",16,{"$f":"VLOOKUP($C$5, Data!$D$8:$DJ$127, Workings!$D20, 0)","v":376},null,null,null,null,null,null,"Q1 2020-21",{"$f":"VLOOKUP($L20, Data!$B$8:$BB$127, 42, 0)","v":0},{"$f":"VLOOKUP($L20, Data!$B$8:$BB$127, 43, 0)","v":0},{"$f":"VLOOKUP($L20, Data!$B$8:$BB$127, 44, 0)","v":0},{"$f":"VLOOKUP($L20, Data!$B$8:$BB$127, 51, 0)","v":0},{"$f":"VLOOKUP($L20, Data!$B$8:$BB$127, 52, 0)","v":0},{"$f":"VLOOKUP($L20, Data!$B$8:$BB$127, 53, 0)","v":0},"Q1 2021-22",null,"Q1 2020-21",13,null,null,"",{"$error":"#N/A"},{"$error":"#N/A"},{"$error":"#N/A"},null,"",{"$error":"#N/A"},{"$error":"#N/A"},{"$error":"#N/A"}]
[null,null,"Total Deaths Reviewed",17,{"$f":"VLOOKUP($C$5, Data!$D$8:$DJ$127, Workings!$D21, 0)","v":266},null,null,null,null,null,null,"Q2 2020-21",{"$f":"VLOOKUP($L21, Data!$B$8:$BB$127, 42, 0)","v":0},{"$f":"VLOOKUP($L21, Data!$B$8:$BB$127, 43, 0)","v":0},{"$f":"VLOOKUP($L21, Data!$B$8:$BB$127, 44, 0)","v":0},{"$f":"VLOOKUP($L21, Data!$B$8:$BB$127, 51, 0)","v":0},{"$f":"VLOOKUP($L21, Data!$B$8:$BB$127, 52, 0)","v":0},{"$f":"VLOOKUP($L21, Data!$B$8:$BB$127, 53, 0)","v":0},"Q2",null,"Q2 2020-21",14,null,null,"",{"$error":"#N/A"},{"$error":"#N/A"},{"$error":"#N/A"},null,"",{"$error":"#N/A"},{"$error":"#N/A"},{"$error":"#N/A"}]
[null,null,"Deaths Avoidable",18,{"$f":"VLOOKUP($C$5, Data!$D$8:$DJ$127, Workings!$D22, 0)","v":40},null,null,null,null,null,null,"Q3 2020-21",{"$f":"VLOOKUP($L22, Data!$B$8:$BB$127, 42, 0)","v":0},{"$f":"VLOOKUP($L22, Data!$B$8:$BB$127, 43, 0)","v":0},{"$f":"VLOOKUP($L22, Data!$B$8:$BB$127, 44, 0)","v":0},{"$f":"VLOOKUP($L22, Data!$B$8:$BB$127, 51, 0)","v":0},{"$f":"VLOOKUP($L22, Data!$B$8:$BB$127, 52, 0)","v":0},{"$f":"VLOOKUP($L22, Data!$B$8:$BB$127, 53, 0)","v":0},"Q3",null,"Q3 2020-21",15,null,null,"",{"$error":"#N/A"},{"$error":"#N/A"},{"$error":"#N/A"},null,"",{"$error":"#N/A"},{"$error":"#N/A"},{"$error":"#N/A"}]
[null,"Comparison trust 2","Total Deaths",19,{"$f":"VLOOKUP($C$5, Data!$D$8:$DJ$127, Workings!$D23, 0)","v":396},null,null,null,null,null,null,"Q4 2020-21",{"$f":"VLOOKUP($L23, Data!$B$8:$BB$127, 42, 0)","v":0},{"$f":"VLOOKUP($L23, Data!$B$8:$BB$127, 43, 0)","v":0},{"$f":"VLOOKUP($L23, Data!$B$8:$BB$127, 44, 0)","v":0},{"$f":"VLOOKUP($L23, Data!$B$8:$BB$127, 51, 0)","v":0},{"$f":"VLOOKUP($L23, Data!$B$8:$BB$127, 52, 0)","v":0},{"$f":"VLOOKUP($L23, Data!$B$8:$BB$127, 53, 0)","v":0},"Q4",null,"Q4 2020-21",16,null,null,"",{"$error":"#N/A"},{"$error":"#N/A"},{"$error":"#N/A"},null,"",{"$error":"#N/A"},{"$error":"#N/A"},{"$error":"#N/A"}]
[null,null,"Total Deaths Reviewed",20,{"$f":"VLOOKUP($C$5, Data!$D$8:$DJ$127, Workings!$D24, 0)","v":326},null,null,null,null,null,null,"Q1 2021-22",{"$f":"VLOOKUP($L24, Data!$B$8:$BB$127, 42, 0)","v":0},{"$f":"VLOOKUP($L24, Data!$B$8:$BB$127, 43, 0)","v":0},{"$f":"VLOOKUP($L24, Data!$B$8:$BB$127, 44, 0)","v":0},{"$f":"VLOOKUP($L24, Data!$B$8:$BB$127, 51, 0)","v":0},{"$f":"VLOOKUP($L24, Data!$B$8:$BB$127, 52, 0)","v":0},{"$f":"VLOOKUP($L24, Data!$B$8:$BB$127, 53, 0)","v":0},"Q1 2022-23",null,"Q1 2021-22",17,null,null,"",{"$error":"#N/A"},{"$error":"#N/A"},{"$error":"#N/A"},null,"",{"$error":"#N/A"},{"$error":"#N/A"},{"$error":"#N/A"}]
[null,null,"Deaths Avoidable",21,{"$f":"VLOOKUP($C$5, Data!$D$8:$DJ$127, Workings!$D25, 0)","v":42},null,null,null,null,null,null,"Q2 2021-22",{"$f":"VLOOKUP($L25, Data!$B$8:$BB$127, 42, 0)","v":0},{"$f":"VLOOKUP($L25, Data!$B$8:$BB$127, 43, 0)","v":0},{"$f":"VLOOKUP($L25, Data!$B$8:$BB$127, 44, 0)","v":0},{"$f":"VLOOKUP($L25, Data!$B$8:$BB$127, 51, 0)","v":0},{"$f":"VLOOKUP($L25, Data!$B$8:$BB$127, 52, 0)","v":0},{"$f":"VLOOKUP($L25, Data!$B$8:$BB$127, 53, 0)","v":0},"Q2",null,"Q2 2021-22",18,null,null,"",{"$error":"#N/A"},{"$error":"#N/A"},{"$error":"#N/A"},null,"",{"$error":"#N/A"},{"$error":"#N/A"},{"$error":"#N/A"}]
[null,"Comparison trust 3","Total Deaths",22,{"$f":"VLOOKUP($C$5, Data!$D$8:$DJ$127, Workings!$D26, 0)","v":378},null,null,null,null,null,null,"Q3 2021-22",{"$f":"VLOOKUP($L26, Data!$B$8:$BB$127, 42, 0)","v":0},{"$f":"VLOOKUP($L26, Data!$B$8:$BB$127, 43, 0)","v":0},{"$f":"VLOOKUP($L26, Data!$B$8:$BB$127, 44, 0)","v":0},{"$f":"VLOOKUP($L26, Data!$B$8:$BB$127, 51, 0)","v":0},{"$f":"VLOOKUP($L26, Data!$B$8:$BB$127, 52, 0)","v":0},{"$f":"VLOOKUP($L26, Data!$B$8:$BB$127, 53, 0)","v":0},"Q3",null,"Q3 2021-22",19,null,null,"",{"$error":"#N/A"},{"$error":"#N/A"},{"$error":"#N/A"},null,"",{"$error":"#N/A"},{"$error":"#N/A"},{"$error":"#N/A"}]
[null,null,"Total Deaths Reviewed",23,{"$f":"VLOOKUP($C$5, Data!$D$8:$DJ$127, Workings!$D27, 0)","v":325},null,null,null,null,null,null,"Q4 2021-22",{"$f":"VLOOKUP($L27, Data!$B$8:$BB$127, 42, 0)","v":0},{"$f":"VLOOKUP($L27, Data!$B$8:$BB$127, 43, 0)","v":0},{"$f":"VLOOKUP($L27, Data!$B$8:$BB$127, 44, 0)","v":0},{"$f":"VLOOKUP($L27, Data!$B$8:$BB$127, 51, 0)","v":0},{"$f":"VLOOKUP($L27, Data!$B$8:$BB$127, 52, 0)","v":0},{"$f":"VLOOKUP($L27, Data!$B$8:$BB$127, 53, 0)","v":0},"Q4",null,"Q4 2021-22",20,null,null,"",{"$error":"#N/A"},{"$error":"#N/A"},{"$error":"#N/A"},null,"",{"$error":"#N/A"},{"$error":"#N/A"},{"$error":"#N/A"}]
[null,null,"Deaths Avoidable",24,{"$f":"VLOOKUP($C$5, Data!$D$8:$DJ$127, Workings!$D28, 0)","v":36},null,null,null,null,null,null,"Q1 2022-23",{"$f":"VLOOKUP($L28, Data!$B$8:$BB$127, 42, 0)","v":0},{"$f":"VLOOKUP($L28, Data!$B$8:$BB$127, 43, 0)","v":0},{"$f":"VLOOKUP($L28, Data!$B$8:$BB$127, 44, 0)","v":0},{"$f":"VLOOKUP($L28, Data!$B$8:$BB$127, 51, 0)","v":0},{"$f":"VLOOKUP($L28, Data!$B$8:$BB$127, 52, 0)","v":0},{"$f":"VLOOKUP($L28, Data!$B$8:$BB$127, 53, 0)","v":0},"Q1 2023-24",null,"Q1 2022-23",21,null,null,"",{"$error":"#N/A"},{"$error":"#N/A"},{"$error":"#N/A"},null,"",{"$error":"#N/A"},{"$error":"#N/A"},{"$error":"#N/A"}]
[null,"Comparison trust 4","Total Deaths",25,{"$f":"VLOOKUP($C$5, Data!$D$8:$DJ$127, Workings!$D29, 0)","v":0},null,null,null,null,null,null,"Q2 2022-23",{"$f":"VLOOKUP($L29, Data!$B$8:$BB$127, 42, 0)","v":0},{"$f":"VLOOKUP($L29, Data!$B$8:$BB$127, 43, 0)","v":0},{"$f":"VLOOKUP($L29, Data!$B$8:$BB$127, 44, 0)","v":0},{"$f":"VLOOKUP($L29, Data!$B$8:$BB$127, 51, 0)","v":0},{"$f":"VLOOKUP($L29, Data!$B$8:$BB$127, 52, 0)","v":0},{"$f":"VLOOKUP($L29, Data!$B$8:$BB$127, 53, 0)","v":0},"Q2",null,"Q2 2022-23",22,null,null,"",{"$error":"#N/A"},{"$error":"#N/A"},{"$error":"#N/A"},null,"",{"$error":"#N/A"},{"$error":"#N/A"},{"$error":"#N/A"}]
[null,null,"Total Deaths Reviewed",26,{"$f":"VLOOKUP($C$5, Data!$D$8:$DJ$127, Workings!$D30, 0)","v":0},null,null,null,null,null,null,"Q3 2022-23",{"$f":"VLOOKUP($L30, Data!$B$8:$BB$127, 42, 0)","v":0},{"$f":"VLOOKUP($L30, Data!$B$8:$BB$127, 43, 0)","v":0},{"$f":"VLOOKUP($L30, Data!$B$8:$BB$127, 44, 0)","v":0},{"$f":"VLOOKUP($L30, Data!$B$8:$BB$127, 51, 0)","v":0},{"$f":"VLOOKUP($L30, Data!$B$8:$BB$127, 52, 0)","v":0},{"$f":"VLOOKUP($L30, Data!$B$8:$BB$127, 53, 0)","v":0},"Q3",null,"Q3 2022-23",23,null,null,"",{"$error":"#N/A"},{"$error":"#N/A"},{"$error":"#N/A"},null,"",{"$error":"#N/A"},{"$error":"#N/A"},{"$error":"#N/A"}]
[null,null,"Deaths Avoidable",27,{"$f":"VLOOKUP($C$5, Data!$D$8:$DJ$127, Workings!$D31, 0)","v":0},null,null,null,null,null,null,"Q4 2022-23",{"$f":"VLOOKUP($L31, Data!$B$8:$BB$127, 42, 0)","v":0},{"$f":"VLOOKUP($L31, Data!$B$8:$BB$127, 43, 0)","v":0},{"$f":"VLOOKUP($L31, Data!$B$8:$BB$127, 44, 0)","v":0},{"$f":"VLOOKUP($L31, Data!$B$8:$BB$127, 51, 0)","v":0},{"$f":"VLOOKUP($L31, Data!$B$8:$BB$127, 52, 0)","v":0},{"$f":"VLOOKUP($L31, Data!$B$8:$BB$127, 53, 0)","v":0},"Q4",null,"Q4 2022-23",24,null,null,"",{"$error":"#N/A"},{"$error":"#N/A"},{"$error":"#N/A"},null,"",{"$error":"#N/A"},{"$error":"#N/A"},{"$error":"#N/A"}]
["Previous month",null,"Total Deaths",28,{"$f":"VLOOKUP($C$5, Data!$D$8:$DJ$127, Workings!$D32, 0)","v":523},null,null,null,null,null,null,"Q1 2023-24",{"$f":"VLOOKUP($L32, Data!$B$8:$BB$127, 42, 0)","v":0},{"$f":"VLOOKUP($L32, Data!$B$8:$BB$127, 43, 0)","v":0},{"$f":"VLOOKUP($L32, Data!$B$8:$BB$127, 44, 0)","v":0},{"$f":"VLOOKUP($L32, Data!$B$8:$BB$127, 51, 0)","v":0},{"$f":"VLOOKUP($L32, Data!$B$8:$BB$127, 52, 0)","v":0},{"$f":"VLOOKUP($L32, Data!$B$8:$BB$127, 53, 0)","v":0},"Q1 2024-25",null,"Q1 2023-24",25,null,null,"",{"$error":"#N/A"},{"$error":"#N/A"},{"$error":"#N/A"},null,"",{"$error":"#N/A"},{"$error":"#N/A"},{"$error":"#N/A"}]
[null,null,"Total Deaths Reviewed",29,{"$f":"VLOOKUP($C$5, Data!$D$8:$DJ$127, Workings!$D33, 0)","v":298},null,null,null,null,null,null,"Q2 2023-24",{"$f":"VLOOKUP($L33, Data!$B$8:$BB$127, 42, 0)","v":0},{"$f":"VLOOKUP($L33, Data!$B$8:$BB$127, 43, 0)","v":0},{"$f":"VLOOKUP($L33, Data!$B$8:$BB$127, 44, 0)","v":0},{"$f":"VLOOKUP($L33, Data!$B$8:$BB$127, 51, 0)","v":0},{"$f":"VLOOKUP($L33, Data!$B$8:$BB$127, 52, 0)","v":0},{"$f":"VLOOKUP($L33, Data!$B$8:$BB$127, 53, 0)","v":0},"Q2",null,"Q2 2023-24",26,null,null,"",{"$error":"#N/A"},{"$error":"#N/A"},{"$error":"#N/A"},null,"",{"$error":"#N/A"},{"$error":"#N/A"},{"$error":"#N/A"}]
[null,null,"Deaths Avoidable",30,{"$f":"VLOOKUP($C$5, Data!$D$8:$DJ$127, Workings!$D34, 0)","v":20},null,null,null,null,null,null,"Q3 2023-24",{"$f":"VLOOKUP($L34, Data!$B$8:$BB$127, 42, 0)","v":0},{"$f":"VLOOKUP($L34, Data!$B$8:$BB$127, 43, 0)","v":0},{"$f":"VLOOKUP($L34, Data!$B$8:$BB$127, 44, 0)","v":0},{"$f":"VLOOKUP($L34, Data!$B$8:$BB$127, 51, 0)","v":0},{"$f":"VLOOKUP($L34, Data!$B$8:$BB$127, 52, 0)","v":0},{"$f":"VLOOKUP($L34, Data!$B$8:$BB$127, 53, 0)","v":0},"Q3",null,"Q3 2023-24",27,null,null,"",{"$error":"#N/A"},{"$error":"#N/A"},{"$error":"#N/A"},null,"",{"$error":"#N/A"},{"$error":"#N/A"},{"$error":"#N/A"}]
[null,null,"RCP1",31,{"$f":"VLOOKUP($C$5, Data!$D$8:$DJ$127, Workings!$D35, 0)","v":4},null,null,null,null,null,null,"Q4 2023-24",{"$f":"VLOOKUP($L35, Data!$B$8:$BB$127, 42, 0)","v":0},{"$f":"VLOOKUP($L35, Data!$B$8:$BB$127, 43, 0)","v":0},{"$f":"VLOOKUP($L35, Data!$B$8:$BB$127, 44, 0)","v":0},{"$f":"VLOOKUP($L35, Data!$B$8:$BB$127, 51, 0)","v":0},{"$f":"VLOOKUP($L35, Data!$B$8:$BB$127, 52, 0)","v":0},{"$f":"VLOOKUP($L35, Data!$B$8:$BB$127, 53, 0)","v":0},"Q4",null,"Q4 2023-24",28,null,null,"",{"$error":"#N/A"},{"$error":"#N/A"},{"$error":"#N/A"},null,"",{"$error":"#N/A"},{"$error":"#N/A"},{"$error":"#N/A"}]
[null,null,"RCP2",32,{"$f":"VLOOKUP($C$5, Data!$D$8:$DJ$127, Workings!$D36, 0)","v":3},null,null,null,null,null,null,"Q1 2024-25",{"$f":"VLOOKUP($L36, Data!$B$8:$BB$127, 42, 0)","v":0},{"$f":"VLOOKUP($L36, Data!$B$8:$BB$127, 43, 0)","v":0},{"$f":"VLOOKUP($L36, Data!$B$8:$BB$127, 44, 0)","v":0},{"$f":"VLOOKUP($L36, Data!$B$8:$BB$127, 51, 0)","v":0},{"$f":"VLOOKUP($L36, Data!$B$8:$BB$127, 52, 0)","v":0},{"$f":"VLOOKUP($L36, Data!$B$8:$BB$127, 53, 0)","v":0},"Q1 2025-26",null,"Q1 2024-25",29,null,null,"",{"$error":"#N/A"},{"$error":"#N/A"},{"$error":"#N/A"},null,"",{"$error":"#N/A"},{"$error":"#N/A"},{"$error":"#N/A"}]
[null,null,"RCP3",33,{"$f":"VLOOKUP($C$5, Data!$D$8:$DJ$127, Workings!$D37, 0)","v":13},null,null,null,null,null,null,"Q2 2024-25",{"$f":"VLOOKUP($L37, Data!$B$8:$BB$127, 42, 0)","v":0},{"$f":"VLOOKUP($L37, Data!$B$8:$BB$127, 43, 0)","v":0},{"$f":"VLOOKUP($L37, Data!$B$8:$BB$127, 44, 0)","v":0},{"$f":"VLOOKUP($L37, Data!$B$8:$BB$127, 51, 0)","v":0},{"$f":"VLOOKUP($L37, Data!$B$8:$BB$127, 52, 0)","v":0},{"$f":"VLOOKUP($L37, Data!$B$8:$BB$127, 53, 0)","v":0},"Q2",null,"Q2 2024-25",30,null,null,"",{"$error":"#N/A"},{"$error":"#N/A"},{"$error":"#N/A"},null,"",{"$error":"#N/A"},{"$error":"#N/A"},{"$error":"#N/A"}]
[null,null,"RCP4",34,{"$f":"VLOOKUP($C$5, Data!$D$8:$DJ$127, Workings!$D38, 0)","v":28},null,null,null,null,null,null,"Q3 2024-25",{"$f":"VLOOKUP($L38, Data!$B$8:$BB$127, 42, 0)","v":0},{"$f":"VLOOKUP($L38, Data!$B$8:$BB$127, 43, 0)","v":0},{"$f":"VLOOKUP($L38, Data!$B$8:$BB$127, 44, 0)","v":0},{"$f":"VLOOKUP($L38, Data!$B$8:$BB$127, 51, 0)","v":0},{"$f":"VLOOKUP($L38, Data!$B$8:$BB$127, 52, 0)","v":0},{"$f":"VLOOKUP($L38, Data!$B$8:$BB$127, 53, 0)","v":0},"Q3",null,"Q3 2024-25",31,null,null,"",{"$error":"#N/A"},{"$error":"#N/A"},{"$error":"#N/A"},null,"",{"$error":"#N/A"},{"$error":"#N/A"},{"$error":"#N/A"}]
[null,null,"RCP5",35,{"$f":"VLOOKUP($C$5, Data!$D$8:$DJ$127, Workings!$D39, 0)","v":56},null,null,null,null,null,null,"Q4 2024-25",{"$f":"VLOOKUP($L39, Data!$B$8:$BB$127, 42, 0)","v":0},{"$f":"VLOOKUP($L39, Data!$B$8:$BB$127, 43, 0)","v":0},{"$f":"VLOOKUP($L39, Data!$B$8:$BB$127, 44, 0)","v":0},{"$f":"VLOOKUP($L39, Data!$B$8:$BB$127, 51, 0)","v":0},{"$f":"VLOOKUP($L39, Data!$B$8:$BB$127, 52, 0)","v":0},{"$f":"VLOOKUP($L39, Data!$B$8:$BB$127, 53, 0)","v":0},"Q4",null,"Q4 2024-25",32,null,null,"",{"$error":"#N/A"},{"$error":"#N/A"},{"$error":"#N/A"},null,"",{"$error":"#N/A"},{"$error":"#N/A"},{"$error":"#N/A"}]
[null,null,"RCP6",36,{"$f":"VLOOKUP($C$5, Data!$D$8:$DJ$127, Workings!$D40, 0)","v":194},null,null,null,null,null,null,"Q1 2025-26",{"$f":"VLOOKUP($L40, Data!$B$8:$BB$127, 42, 0)","v":0},{"$f":"VLOOKUP($L40, Data!$B$8:$BB$127, 43, 0)","v":0},{"$f":"VLOOKUP($L40, Data!$B$8:$BB$127, 44, 0)","v":0},{"$f":"VLOOKUP($L40, Data!$B$8:$BB$127, 51, 0)","v":0},{"$f":"VLOOKUP($L40, Data!$B$8:$BB$127, 52, 0)","v":0},{"$f":"VLOOKUP($L40, Data!$B$8:$BB$127, 53, 0)","v":0},"Q1 2026-27",null,"Q1 2025-26",33,null,null,"",{"$error":"#N/A"},{"$error":"#N/A"},{"$error":"#N/A"},null,"",{"$error":"#N/A"},{"$error":"#N/A"},{"$error":"#N/A"}]
[null,null,"LD Total Deaths",37,{"$f":"VLOOKUP($C$5, Data!$D$8:$DJ$127, Workings!$D41, 0)","v":2},null,null,null,null,null,null,"Q2 2025-26",{"$f":"VLOOKUP($L41, Data!$B$8:$BB$127, 42, 0)","v":0},{"$f":"VLOOKUP($L41, Data!$B$8:$BB$127, 43, 0)","v":0},{"$f":"VLOOKUP($L41, Data!$B$8:$BB$127, 44, 0)","v":0},{"$f":"VLOOKUP($L41, Data!$B$8:$BB$127, 51, 0)","v":0},{"$f":"VLOOKUP($L41, Data!$B$8:$BB$127, 52, 0)","v":0},{"$f":"VLOOKUP($L41, Data!$B$8:$BB$127, 53, 0)","v":0},"Q2",null,"Q2 2025-26",34,null,null,"",{"$error":"#N/A"},{"$error":"#N/A"},{"$error":"#N/A"},null,"",{"$error":"#N/A"},{"$error":"#N/A"},{"$error":"#N/A"}]
[null,null,"LD Reviewed",38,{"$f":"VLOOKUP($C$5, Data!$D$8:$DJ$127, Workings!$D42, 0)","v":2},null,null,null,null,null,null,"Q3 2025-26",{"$f":"VLOOKUP($L42, Data!$B$8:$BB$127, 42, 0)","v":0},{"$f":"VLOOKUP($L42, Data!$B$8:$BB$127, 43, 0)","v":0},{"$f":"VLOOKUP($L42, Data!$B$8:$BB$127, 44, 0)","v":0},{"$f":"VLOOKUP($L42, Data!$B$8:$BB$127, 51, 0)","v":0},{"$f":"VLOOKUP($L42, Data!$B$8:$BB$127, 52, 0)","v":0},{"$f":"VLOOKUP($L42, Data!$B$8:$BB$127, 53, 0)","v":0},"Q3",null,"Q3 2025-26",35,null,null,"",{"$error":"#N/A"},{"$error":"#N/A"},{"$error":"#N/A"},null,"",{"$error":"#N/A"},{"$error":"#N/A"},{"$error":"#N/A"}]
[null,null,"LD Avoidable",39,{"$f":"VLOOKUP($C$5, Data!$D$8:$DJ$127, Workings!$D43, 0)","v":0},null,null,null,null,null,null,"Q4 2025-26",{"$f":"VLOOKUP($L43, Data!$B$8:$BB$127, 42, 0)","v":0},{"$f":"VLOOKUP($L43, Data!$B$8:$BB$127, 43, 0)","v":0},{"$f":"VLOOKUP($L43, Data!$B$8:$BB$127, 44, 0)","v":0},{"$f":"VLOOKUP($L43, Data!$B$8:$BB$127, 51, 0)","v":0},{"$f":"VLOOKUP($L43, Data!$B$8:$BB$127, 52, 0)","v":0},{"$f":"VLOOKUP($L43, Data!$B$8:$BB$127, 53, 0)","v":0},"Q4",null,"Q4 2025-26",36,null,null,"",{"$error":"#N/A"},{"$error":"#N/A"},{"$error":"#N/A"},null,"",{"$error":"#N/A"},{"$error":"#N/A"},{"$error":"#N/A"}]
["this quarter",null,"Total Deaths",40,{"$f":"VLOOKUP($C$5, Data!$D$8:$DJ$127, Workings!$D44, 0)","v":1436},null,null,null,null,null,null,"Q1 2026-27",{"$f":"VLOOKUP($L44, Data!$B$8:$BB$127, 42, 0)","v":0},{"$f":"VLOOKUP($L44, Data!$B$8:$BB$127, 43, 0)","v":0},{"$f":"VLOOKUP($L44, Data!$B$8:$BB$127, 44, 0)","v":0},{"$f":"VLOOKUP($L44, Data!$B$8:$BB$127, 51, 0)","v":0},{"$f":"VLOOKUP($L44, Data!$B$8:$BB$127, 52, 0)","v":0},{"$f":"VLOOKUP($L44, Data!$B$8:$BB$127, 53, 0)","v":0},"Q1 2027-28",null,"Q1 2026-27",37,null,null,"",{"$error":"#N/A"},{"$error":"#N/A"},{"$error":"#N/A"},null,"",{"$error":"#N/A"},{"$error":"#N/A"},{"$error":"#N/A"}]
[null,null,"Total Deaths Reviewed",41,{"$f":"VLOOKUP($C$5, Data!$D$8:$DJ$127, Workings!$D45, 0)","v":939},null,null,null,null,null,null,"Q2 2026-27",{"$f":"VLOOKUP($L45, Data!$B$8:$BB$127, 42, 0)","v":0},{"$f":"VLOOKUP($L45, Data!$B$8:$BB$127, 43, 0)","v":0},{"$f":"VLOOKUP($L45, Data!$B$8:$BB$127, 44, 0)","v":0},{"$f":"VLOOKUP($L45, Data!$B$8:$BB$127, 51, 0)","v":0},{"$f":"VLOOKUP($L45, Data!$B$8:$BB$127, 52, 0)","v":0},{"$f":"VLOOKUP($L45, Data!$B$8:$BB$127, 53, 0)","v":0},"Q2",null,"Q2 2026-27",38,null,null,"",{"$error":"#N/A"},{"$error":"#N/A"},{"$error":"#N/A"},null,"",{"$error":"#N/A"},{"$error":"#N/A"},{"$error":"#N/A"}]
[null,null,"Deaths Avoidable",42,{"$f":"VLOOKUP($C$5, Data!$D$8:$DJ$127, Workings!$D46, 0)","v":50},null,null,null,null,null,null,"Q3 2026-27",{"$f":"VLOOKUP($L46, Data!$B$8:$BB$127, 42, 0)","v":0},{"$f":"VLOOKUP($L46, Data!$B$8:$BB$127, 43, 0)","v":0},{"$f":"VLOOKUP($L46, Data!$B$8:$BB$127, 44, 0)","v":0},{"$f":"VLOOKUP($L46, Data!$B$8:$BB$127, 51, 0)","v":0},{"$f":"VLOOKUP($L46, Data!$B$8:$BB$127, 52, 0)","v":0},{"$f":"VLOOKUP($L46, Data!$B$8:$BB$127, 53, 0)","v":0},"Q3",null,"Q3 2026-27",39,null,null,"",{"$error":"#N/A"},{"$error":"#N/A"},{"$error":"#N/A"},null,"",{"$error":"#N/A"},{"$error":"#N/A"},{"$error":"#N/A"}]
[null,null,"RCP1",43,{"$f":"VLOOKUP($C$5, Data!$D$8:$DJ$127, Workings!$D47, 0)","v":5},null,null,null,null,null,null,"Q4 2026-27",{"$f":"VLOOKUP($L47, Data!$B$8:$BB$127, 42, 0)","v":0},{"$f":"VLOOKUP($L47, Data!$B$8:$BB$127, 43, 0)","v":0},{"$f":"VLOOKUP($L47, Data!$B$8:$BB$127, 44, 0)","v":0},{"$f":"VLOOKUP($L47, Data!$B$8:$BB$127, 51, 0)","v":0},{"$f":"VLOOKUP($L47, Data!$B$8:$BB$127, 52, 0)","v":0},{"$f":"VLOOKUP($L47, Data!$B$8:$BB$127, 53, 0)","v":0},"Q4",null,"Q4 2026-27",40,null,null,"",{"$error":"#N/A"},{"$error":"#N/A"},{"$error":"#N/A"},null,"",{"$error":"#N/A"},{"$error":"#N/A"},{"$error":"#N/A"}]
[null,null,"RCP2",44,{"$f":"VLOOKUP($C$5, Data!$D$8:$DJ$127, Workings!$D48, 0)","v":14}]
[null,null,"RCP3",45,{"$f":"VLOOKUP($C$5, Data!$D$8:$DJ$127, Workings!$D49, 0)","v":31}]
[null,null,"RCP4",46,{"$f":"VLOOKUP($C$5, Data!$D$8:$DJ$127, Workings!$D50, 0)","v":90}]
[null,null,"RCP5",47,{"$f":"VLOOKUP($C$5, Data!$D$8:$DJ$127, Workings!$D51, 0)","v":178}]
[null,null,"RCP6",48,{"$f":"VLOOKUP($C$5, Data!$D$8:$DJ$127, Workings!$D52, 0)","v":621}]
[null,null,"LD Total Deaths",49,{"$f":"VLOOKUP($C$5, Data!$D$8:$DJ$127, Workings!$D53, 0)","v":16}]
[null,null,"LD Reviewed",50,{"$f":"VLOOKUP($C$5, Data!$D$8:$DJ$127, Workings!$D54, 0)","v":16}]
[null,null,"LD Avoidable",51,{"$f":"VLOOKUP($C$5, Data!$D$8:$DJ$127, Workings!$D55, 0)","v":3}]
[null,"Comparison trust 1","Total Deaths",52,{"$f":"VLOOKUP($C$5, Data!$D$8:$DJ$127, Workings!$D56, 0)","v":1035}]
[null,null,"Total Deaths Reviewed",53,{"$f":"VLOOKUP($C$5, Data!$D$8:$DJ$127, Workings!$D57, 0)","v":719}]
[null,null,"Deaths Avoidable",54,{"$f":"VLOOKUP($C$5, Data!$D$8:$DJ$127, Workings!$D58, 0)","v":106}]
[null,"Comparison trust 2","Total Deaths",55,{"$f":"VLOOKUP($C$5, Data!$D$8:$DJ$127, Workings!$D59, 0)","v":1087}]
[null,null,"Total Deaths Reviewed",56,{"$f":"VLOOKUP($C$5, Data!$D$8:$DJ$127, Workings!$D60, 0)","v":625}]
[null,null,"Deaths Avoidable",57,{"$f":"VLOOKUP($C$5, Data!$D$8:$DJ$127, Workings!$D61, 0)","v":86}]
[null,"Comparison trust 3","Total Deaths",58,{"$f":"VLOOKUP($C$5, Data!$D$8:$DJ$127, Workings!$D62, 0)","v":1038}]
[null,null,"Total Deaths Reviewed",59,{"$f":"VLOOKUP($C$5, Data!$D$8:$DJ$127, Workings!$D63, 0)","v":598}]
[null,null,"Deaths Avoidable",60,{"$f":"VLOOKUP($C$5, Data!$D$8:$DJ$127, Workings!$D64, 0)","v":83}]
[null,"Comparison trust 4","Total Deaths",61,{"$f":"VLOOKUP($C$5, Data!$D$8:$DJ$127, Workings!$D65, 0)","v":0}]
[null,null,"Total Deaths Reviewed",62,{"$f":"VLOOKUP($C$5, Data!$D$8:$DJ$127, Workings!$D66, 0)","v":0}]
[null,null,"Deaths Avoidable",63,{"$f":"VLOOKUP($C$5, Data!$D$8:$DJ$127, Workings!$D67, 0)","v":0}]
["Previous quarter",null,"Total Deaths",64,{"$f":"VLOOKUP($C$5, Data!$D$8:$DJ$127, Workings!$D68, 0)","v":1509}]
[null,null,"Total Deaths Reviewed",65,{"$f":"VLOOKUP($C$5, Data!$D$8:$DJ$127, Workings!$D69, 0)","v":1053}]
[null,null,"Deaths Avoidable",66,{"$f":"VLOOKUP($C$5, Data!$D$8:$DJ$127, Workings!$D70, 0)","v":54}]
[null,null,"RCP1",67,{"$f":"VLOOKUP($C$5, Data!$D$8:$DJ$127, Workings!$D71, 0)","v":6}]
[null,null,"RCP2",68,{"$f":"VLOOKUP($C$5, Data!$D$8:$DJ$127, Workings!$D72, 0)","v":11}]
[null,null,"RCP3",69,{"$f":"VLOOKUP($C$5, Data!$D$8:$DJ$127, Workings!$D73, 0)","v":37}]
[null,null,"RCP4",70,{"$f":"VLOOKUP($C$5, Data!$D$8:$DJ$127, Workings!$D74, 0)","v":99}]
[null,null,"RCP5",71,{"$f":"VLOOKUP($C$5, Data!$D$8:$DJ$127, Workings!$D75, 0)","v":200}]
[null,null,"RCP6",72,{"$f":"VLOOKUP($C$5, Data!$D$8:$DJ$127, Workings!$D76, 0)","v":700}]
[null,null,"LD Total Deaths",73,{"$f":"VLOOKUP($C$5, Data!$D$8:$DJ$127, Workings!$D77, 0)","v":24}]
[null,null,"LD Reviewed",74,{"$f":"VLOOKUP($C$5, Data!$D$8:$DJ$127, Workings!$D78, 0)","v":24}]
[null,null,"LD Avoidable",75,{"$f":"VLOOKUP($C$5, Data!$D$8:$DJ$127, Workings!$D79, 0)","v":4}]
["this year",null,"Total Deaths",76,{"$f":"VLOOKUP($C$5, Data!$D$8:$DJ$127, Workings!$D80, 0)","v":6069}]
[null,null,"Total Deaths Reviewed",77,{"$f":"VLOOKUP($C$5, Data!$D$8:$DJ$127, Workings!$D81, 0)","v":3991}]
[null,null,"Deaths Avoidable",78,{"$f":"VLOOKUP($C$5, Data!$D$8:$DJ$127, Workings!$D82, 0)","v":227}]
[null,null,"RCP1",79,{"$f":"VLOOKUP($C$5, Data!$D$8:$DJ$127, Workings!$D83, 0)","v":30}]
[null,null,"RCP2",80,{"$f":"VLOOKUP($C$5, Data!$D$8:$DJ$127, Workings!$D84, 0)","v":65}]
[null,null,"RCP3",81,{"$f":"VLOOKUP($C$5, Data!$D$8:$DJ$127, Workings!$D85, 0)","v":132}]
[null,null,"RCP4",82,{"$f":"VLOOKUP($C$5, Data!$D$8:$DJ$127, Workings!$D86, 0)","v":378}]
[null,null,"RCP5",83,{"$f":"VLOOKUP($C$5, Data!$D$8:$DJ$127, Workings!$D87, 0)","v":754}]
[null,null,"RCP6",84,{"$f":"VLOOKUP($C$5, Data!$D$8:$DJ$127, Workings!$D88, 0)","v":2632}]
[null,null,"LD Total Deaths",85,{"$f":"VLOOKUP($C$5, Data!$D$8:$DJ$127, Workings!$D89, 0)","v":75}]
[null,null,"LD Reviewed",86,{"$f":"VLOOKUP($C$5, Data!$D$8:$DJ$127, Workings!$D90, 0)","v":75}]
[null,null,"LD Avoidable",87,{"$f":"VLOOKUP($C$5, Data!$D$8:$DJ$127, Workings!$D91, 0)","v":19}]
[null,"Comparison trust 1","Total Deaths",88,{"$f":"VLOOKUP($C$5, Data!$D$8:$DJ$127, Workings!$D92, 0)","v":4057}]
[null,null,"Total Deaths Reviewed",89,{"$f":"VLOOKUP($C$5, Data!$D$8:$DJ$127, Workings!$D93, 0)","v":2363}]
[null,null,"Deaths Avoidable",90,{"$f":"VLOOKUP($C$5, Data!$D$8:$DJ$127, Workings!$D94, 0)","v":343}]
[null,"Comparison trust 2","Total Deaths",91,{"$f":"VLOOKUP($C$5, Data!$D$8:$DJ$127, Workings!$D95, 0)","v":4186}]
[null,null,"Total Deaths Reviewed",92,{"$f":"VLOOKUP($C$5, Data!$D$8:$DJ$127, Workings!$D96, 0)","v":2183}]
[null,null,"Deaths Avoidable",93,{"$f":"VLOOKUP($C$5, Data!$D$8:$DJ$127, Workings!$D97, 0)","v":302}]
[null,"Comparison trust 3","Total Deaths",94,{"$f":"VLOOKUP($C$5, Data!$D$8:$DJ$127, Workings!$D98, 0)","v":4073}]
[null,null,"Total Deaths Reviewed",95,{"$f":"VLOOKUP($C$5, Data!$D$8:$DJ$127, Workings!$D99, 0)","v":1773}]
[null,null,"Deaths Avoidable",96,{"$f":"VLOOKUP($C$5, Data!$D$8:$DJ$127, Workings!$D100, 0)","v":269}]
[null,"Comparison trust 4","Total Deaths",97,{"$f":"VLOOKUP($C$5, Data!$D$8:$DJ$127, Workings!$D101, 0)","v":0}]
[null,null,"Total Deaths Reviewed",98,{"$f":"VLOOKUP($C$5, Data!$D$8:$DJ$127, Workings!$D102, 0)","v":0}]
[null,null,"Deaths Avoidable",99,{"$f":"VLOOKUP($C$5, Data!$D$8:$DJ$127, Workings!$D103, 0)","v":0}]
["prevous year",null,"Total Deaths",100,{"$f":"VLOOKUP($C$5, Data!$D$8:$DJ$127, Workings!$D104, 0)","v":0}]
[null,null,"Total Deaths Reviewed",101,{"$f":"VLOOKUP($C$5, Data!$D$8:$DJ$127, Workings!$D105, 0)","v":0}]
[null,null,"Deaths Avoidable",102,{"$f":"VLOOKUP($C$5, Data!$D$8:$DJ$127, Workings!$D106, 0)","v":0}]
[null,null,"RCP1",103,{"$f":"VLOOKUP($C$5, Data!$D$8:$DJ$127, Workings!$D107, 0)","v":0}]
[null,null,"RCP2",104,{"$f":"VLOOKUP($C$5, Data!$D$8:$DJ$127, Workings!$D108, 0)","v":0}]
[null,null,"RCP3",105,{"$f":"VLOOKUP($C$5, Data!$D$8:$DJ$127, Workings!$D109, 0)","v":0}]
[null,null,"RCP4",106,{"$f":"VLOOKUP($C$5, Data!$D$8:$DJ$127, Workings!$D110, 0)","v":0}]
[null,null,"RCP5",107,{"$f":"VLOOKUP($C$5, Data!$D$8:$DJ$127, Workings!$D111, 0)","v":0}]
[null,null,"RCP6",108,{"$f":"VLOOKUP($C$5, Data!$D$8:$DJ$127, Workings!$D112, 0)","v":0}]
[null,null,"LD Total Deaths",109,{"$f":"VLOOKUP($C$5, Data!$D$8:$DJ$127, Workings!$D113, 0)","v":0}]
[null,null,"LD Reviewed",110,{"$f":"VLOOKUP($C$5, Data!$D$8:$DJ$127, Workings!$D114, 0)","v":0}]
[null,null,"LD Avoidable",111,{"$f":"VLOOKUP($C$5, Data!$D$8:$DJ$127, Workings!$D115, 0)","v":0}]

{"sheet":"Data","index":5,"n_rows":127,"n_cols":114,"rows_kept":127,"cut":false,"hidden":false,"merged":[[5,9,5,14]]}
[null,null,null,null,"Trust",{"$f":"'Front Sheet'!E6","v":"NHS Anytown Foundation Trust"}]
[null,null,null,null,"Org Code"]
[null,null,null,null,"Month",{"$f":"'Front Sheet'!E10","v":"September"}]
[null,null,null,null,"Year",{"$f":"'Front Sheet'!E8","v":"2017-18"},null,null,null,null,null,null,null,null,null,null,null,null,null,null,null,null,null,null,null,null,null,null,null,null,"Previous month",null,null,null,null,null,null,null,null,null,null,null,"This Quarter",null,null,null,null,null,null,null,null,null,null,null,null,null,null,null,null,null,null,null,null,null,null,null,"Previous quarter",null,null,null,null,null,null,null,null,null,null,null,"This year",null,null,null,null,null,null,null,null,null,null,null,null,null,null,null,null,null,null,null,null,null,null,null,"Previous year"]
[]
[null,null,null,null,null,null,null,null,null,"PRISM Score",null,null,null,null,null,null,null,null,"Comparison trust 1",null,null,"Comparison trust 2",null,null,"Comparison trust 3",null,null,null,null,null,null,null,null,null,null,null,null,null,null,null,null,null,null,null,null,null,null,null,null,null,null,null,null,null,"Comparison trust 1",null,null,"Comparison trust 2",null,null,"Comparison trust 3",null,null,"Comparison trust 4",null,null,null,null,null,null,null,null,null,null,null,null,null,null,null,null,null,null,null,null,null,null,null,null,null,null,"Comparison trust 1",null,null,"Comparison trust 2",null,null,"Comparison trust 3",null,null,"Comparison trust 4"]
["quart","quart code","month","month code","Financial Year","Month","Total Deaths (not LD)","Total Deaths Reviewed (not LD)","Deaths Avoidable > 50% (not LD)",1,2,3,4,5,6,"LD Deaths","LD Deaths Reviewed","LD Deaths Avoidable > 50%","Total Deaths","Total Deaths Reviewed","Deaths Avoidable > 50%","Total Deaths","Total Deaths Reviewed","Deaths Avoidable > 50%","Total Deaths","Total Deaths Reviewed","Deaths Avoidable > 50%","Total Deaths","Total Deaths Reviewed","Deaths Avoidable > 50%","Total Deaths","Total Deaths Reviewed","Deaths Avoidable","RCP1","RCP2","RCP3","RCP4","RCP5","RCP6","LD Deaths","LD Deaths Reviewed","LD Deaths Avoidable > 50%","Total Deaths","Total Deaths Reviewed","Deaths Avoidable","RCP1","RCP2","RCP3","RCP4","RCP5","RCP6","LD Deaths","LD Deaths Reviewed","LD Deaths Avoidable > 50%","Total Deaths","Total Deaths Reviewed","Deaths Avoidable","Total Deaths","Total Deaths Reviewed","Deaths Avoidable","Total Deaths","Total Deaths Reviewed","Deaths Avoidable","Total Deaths","Total Deaths Reviewed","Deaths Avoidable","Total Deaths","Total Deaths Reviewed","Deaths Avoidable","RCP1","RCP2","RCP3","RCP4","RCP5","RCP6","LD Deaths","LD Deaths Reviewed","LD Deaths Avoidable > 50%","Total Deaths","Total Deaths Reviewed","Deaths Avoidable","RCP1","RCP2","RCP3","RCP4","RCP5","RCP6","LD Deaths","LD Deaths Reviewed","LD Deaths Avoidable > 50%","Total Deaths","Total Deaths Reviewed","Deaths Avoidable","Total Deaths","Total Deaths Reviewed","Deaths Avoidable","Total Deaths","Total Deaths Reviewed","Deaths Avoidable","Total Deaths","Total Deaths Reviewed","Deaths Avoidable","Total Deaths","Total Deaths Reviewed","Deaths Avoidable","RCP1","RCP2","RCP3","RCP4","RCP5","RCP6","LD Deaths","LD Deaths Reviewed","LD Deaths Avoidable > 50%"]
["Q1",{"$f":"A8&\" \"&E8","v":"Q1 2017-18"},"Apr, 17-18",{"$f":"E8&F8","v":"2017-18April"},"2017-18","April",509,358,15,1,4,10,34,69,240,4,4,0,389,205,47,313,217,33,344,56,7,null,null,null,0,0,0,0,0,0,0,0,0,0,0,0,{"$f":"SUM(G$8:G$10)","v":1509},1053,54,{"$f":"SUM(J$8:J$10)","v":6},11,37,99,200,700,24,24,4,1026,{"$f":"SUM(T$8:T$10)","v":492},82,1054,331,46,994,395,58,0,0,{"$f":"SUM(AD$8:AD$10)","v":0},0,0,0,0,0,0,0,0,0,0,0,0,{"$f":"SUM(G$8:G$19)","v":6069},{"$f":"SUM(H$8:H$19)","v":3991},{"$f":"SUM(I$8:I$19)","v":227},{"$f":"SUM(J$8:J$19)","v":30},{"$f":"SUM(K$8:K$19)","v":65},{"$f":"SUM(L$8:L$19)","v":132},{"$f":"SUM(M$8:M$19)","v":378},{"$f":"SUM(N$8:N$19)","v":754},{"$f":"SUM(O$8:O$19)","v":2632},{"$f":"SUM(P$8:P$19)","v":75},75,19,{"$f":"SUM(S$8:S$19)","v":4057},{"$f":"SUM(T$8:T$19)","v":2363},{"$f":"SUM(U$8:U$19)","v":343},{"$f":"SUM(V$8:V$19)","v":4186},{"$f":"SUM(W$8:W$19)","v":2183},{"$f":"SUM(X$8:X$19)","v":302},{"$f":"SUM(Y$8:Y$19)","v":4073},{"$f":"SUM(Z$8:Z$19)","v":1773},{"$f":"SUM(AA$8:AA$19)","v":269},{"$f":"SUM(AB$8:AB$19)","v":0},{"$f":"SUM(AC$8:AC$19)","v":0},{"$f":"SUM(AD$8:AD$19)","v":0},0,0,0,0,0,0,0,0,0,0,0,0]
["Q1",{"$f":"A9&\" \"&E9","v":"Q1 2017-18"},"May",{"$f":"E9&F9","v":"2017-18May"},"2017-18","May",478,350,18,3,5,10,33,66,233,8,8,2,328,62,8,378,71,7,308,144,22,null,null,null,{"$f":"G8","v":509},{"$f":"H8","v":358},15,1,4,10,34,69,{"$f":"O8","v":240},{"$f":"P8","v":4},4,0,1509,1053,54,6,11,37,99,200,700,24,24,4,1026,492,82,1054,331,46,994,395,58,0,0,0,0,0,0,0,0,0,0,0,0,0,0,0,6069,3991,227,30,65,132,378,754,2632,75,75,19,4057,2363,343,4186,2183,302,4073,1773,269,0,0,0,0,0,0,0,0,0,0,0,0,0,0,0]
["Q1","Q1 2017-18","Jun","2017-18June","2017-18","June",522,345,21,2,2,17,32,65,227,12,12,2,309,225,27,363,43,6,342,195,29,null,null,null,{"$f":"G9","v":478},{"$f":"H9","v":350},{"$f":"I9","v":18},{"$f":"J9","v":3},{"$f":"K9","v":5},{"$f":"L9","v":10},{"$f":"M9","v":33},{"$f":"N9","v":66},233,8,8,2,1509,1053,54,6,11,37,99,200,700,24,24,4,1026,492,82,1054,331,46,994,395,58,0,0,0,0,0,0,0,0,0,0,0,0,0,0,0,6069,3991,227,30,65,132,378,754,2632,75,75,19,4057,2363,343,4186,2183,302,4073,1773,269,0,0,0,0,0,0,0,0,0,0,0,0,0,0,0]
["Q2","Q2 2017-18","Jul","2017-18July","2017-18","July",459,302,16,1,7,8,29,57,200,4,4,1,346,283,42,320,29,3,300,195,25,null,null,null,522,345,21,2,2,17,32,65,227,12,12,2,{"$f":"SUM(G$11:G$13)","v":1436},939,50,5,14,31,90,178,621,16,{"$f":"SUM(Q$11:Q$13)","v":16},3,1035,719,106,1087,625,86,1038,598,{"$f":"SUM(AA$11:AA$13)","v":83},0,0,0,{"$f":"AQ8","v":1509},1053,54,6,11,37,99,200,700,{"$f":"AZ8","v":24},24,4,6069,3991,227,30,65,132,378,754,2632,75,75,19,4057,2363,343,4186,2183,302,4073,1773,269,0,0,0,0,0,0,0,0,0,0,0,0,0,0,0]
["Q2","Q2 2017-18","Aug","2017-18August","2017-18","August",523,298,20,4,3,13,28,56,194,2,2,0,313,170,24,371,270,41,360,78,22,null,null,null,459,302,16,1,7,8,29,57,200,4,4,1,1436,939,50,5,14,31,90,178,621,16,16,3,1035,719,106,1087,625,86,1038,598,83,0,0,0,{"$f":"AQ9","v":1509},{"$f":"AR9","v":1053},{"$f":"AS9","v":54},{"$f":"AT9","v":6},{"$f":"AU9","v":11},{"$f":"AV9","v":37},{"$f":"AW9","v":99},{"$f":"AX9","v":200},{"$f":"AY9","v":700},24,24,4,6069,3991,227,30,65,132,378,754,2632,75,75,19,4057,2363,343,4186,2183,302,4073,1773,269,0,0,0,0,0,0,0,0,0,0,0,0,0,0,0]
["Q2","Q2 2017-18","Sep","2017-18September","2017-18","September",454,339,14,0,4,10,33,65,227,10,10,2,376,266,40,396,326,42,378,325,36,null,null,null,523,298,20,4,3,13,28,56,194,2,2,0,1436,939,50,5,14,31,90,178,621,16,16,3,1035,719,106,1087,625,86,1038,598,83,0,0,0,1509,1053,54,6,11,37,99,200,700,24,24,4,6069,3991,227,30,65,132,378,754,2632,75,75,19,4057,2363,343,4186,2183,302,4073,1773,269,0,0,0,0,0,0,0,0,0,0,0,0,0,0,0]
["Q3","Q3 2017-18","Oct","2017-18October","2017-18","October",470,340,22,2,9,11,32,64,222,7,7,2,363,189,23,339,298,39,378,34,5,null,null,null,454,339,14,0,4,10,33,65,227,10,10,2,{"$f":"SUM(G$14:G$16)","v":1565},979,67,6,24,37,92,183,637,11,{"$f":"SUM(Q$14:Q$16)","v":11},3,993,670,92,1037,685,97,1103,420,{"$f":"SUM(AA$14:AA$16)","v":84},0,0,0,1436,939,50,5,14,31,90,178,621,16,16,3,6069,3991,227,30,65,132,378,754,2632,75,75,19,4057,2363,343,4186,2183,302,4073,1773,269,0,0,0,0,0,0,0,0,0,0,0,0,0,0,0]
["Q3","Q3 2017-18","Nov","2017-18November","2017-18","November",547,352,26,2,7,17,33,65,228,1,1,0,320,209,31,336,252,38,337,285,43,null,null,null,470,340,22,2,9,11,32,64,222,7,7,2,1565,979,67,6,24,37,92,183,637,11,11,3,993,670,92,1037,685,97,1103,420,84,0,0,0,1436,939,50,5,14,31,90,178,621,16,16,3,6069,3991,227,30,65,132,378,754,2632,75,75,19,4057,2363,343,4186,2183,302,4073,1773,269,0,0,0,0,0,0,0,0,0,0,0,0,0,0,0]
["Q3","Q3 2017-18","Dec","2017-18December","2017-18","December",548,287,19,2,8,9,27,54,187,3,3,1,310,272,38,362,135,20,388,101,36,null,null,null,547,352,26,2,7,17,33,65,228,1,1,0,1565,979,67,6,24,37,92,183,637,11,11,3,993,670,92,1037,685,97,1103,420,84,0,0,0,1436,939,50,5,14,31,90,178,621,16,16,3,6069,3991,227,30,65,132,378,754,2632,75,75,19,4057,2363,343,4186,2183,302,4073,1773,269,0,0,0,0,0,0,0,0,0,0,0,0,0,0,0]
["Q4","Q4 2017-18","Jan","2017-18January","2017-18","January",539,363,18,5,3,10,35,69,241,4,4,2,367,135,20,313,219,24,312,170,24,null,null,null,548,287,19,2,8,9,27,54,187,3,3,1,{"$f":"SUM(G$17:G$19)","v":1559},1020,56,13,16,27,97,193,674,24,{"$f":"SUM(Q$17:Q$19)","v":24},9,1003,482,63,1008,542,73,938,360,{"$f":"SUM(AA$17:AA$19)","v":44},0,0,0,1565,979,67,6,24,37,92,183,637,11,11,3,6069,3991,227,30,65,132,378,754,2632,75,75,19,4057,2363,343,4186,2183,302,4073,1773,269,0,0,0,0,0,0,0,0,0,0,0,0,0,0,0]
["Q4","Q4 2017-18","Feb","2017-18February","2017-18","February",487,356,22,5,10,7,33,67,234,8,8,3,306,170,22,370,210,32,320,135,14,null,null,null,539,363,18,5,3,10,35,69,241,4,4,2,1559,1020,56,13,16,27,97,193,674,24,24,9,1003,482,63,1008,542,73,938,360,44,0,0,0,1565,979,67,6,24,37,92,183,637,11,11,3,6069,3991,227,30,65,132,378,754,2632,75,75,19,4057,2363,343,4186,2183,302,4073,1773,269,0,0,0,0,0,0,0,0,0,0,0,0,0,0,0]
["Q4","Q4 2017-18","Mar","2017-18March","2017-18","March",533,301,16,3,3,10,29,57,199,12,12,4,330,177,21,325,113,17,306,55,6,null,null,null,487,356,22,5,10,7,33,67,234,8,8,3,1559,1020,56,13,16,27,97,193,674,24,24,9,1003,482,63,1008,542,73,938,360,44,0,0,0,1565,979,67,6,24,37,92,183,637,11,11,3,6069,3991,227,30,65,132,378,754,2632,75,75,19,4057,2363,343,4186,2183,302,4073,1773,269,0,0,0,0,0,0,0,0,0,0,0,0,0,0,0]
["Q1","Q1 2018-19","Apr, 18-19","2018-19April","2018-19","April",470,339,20,4,3,13,32,64,223,9,9,1,350,252,30,381,349,42,358,97,14,null,null,null,533,301,16,3,3,10,29,57,199,12,12,4,{"$f":"SUM(G$20:G$22)","v":1456},942,44,{"$f":"SUM(J$20:J$22)","v":6},10,28,90,180,628,29,29,6,1067,{"$f":"SUM(T$20:T$22)","v":813},100,1100,761,87,1029,543,70,0,0,{"$f":"SUM(AD$20:AD$22)","v":0},1559,1020,56,13,16,27,97,193,674,24,24,9,{"$f":"SUM(G$20:G$31)","v":2943},{"$f":"SUM(H$20:H$31)","v":1971},{"$f":"SUM(I$20:I$31)","v":99},{"$f":"SUM(J$20:J$31)","v":15},{"$f":"SUM(K$20:K$31)","v":21},{"$f":"SUM(L$20:L$31)","v":63},{"$f":"SUM(M$20:M$31)","v":187},{"$f":"SUM(N$20:N$31)","v":375},{"$f":"SUM(O$20:O$31)","v":1310},{"$f":"SUM(P$20:P$31)","v":44},44,8,{"$f":"SUM(S$20:S$31)","v":2091},{"$f":"SUM(T$20:T$31)","v":1558},{"$f":"SUM(U$20:U$31)","v":193},{"$f":"SUM(V$20:V$31)","v":2281},{"$f":"SUM(W$20:W$31)","v":1124},{"$f":"SUM(X$20:X$31)","v":125},{"$f":"SUM(Y$20:Y$31)","v":2006},{"$f":"SUM(Z$20:Z$31)","v":998},{"$f":"SUM(AA$20:AA$31)","v":128},{"$f":"SUM(AB$20:AB$31)","v":0},{"$f":"SUM(AC$20:AC$31)","v":0},{"$f":"SUM(AD$20:AD$31)","v":0},{"$f":"CA8","v":6069},{"$f":"CB8","v":3991},227,30,65,132,378,754,2632,{"$f":"CJ8","v":75},{"$f":"CK8","v":75},{"$f":"CL8","v":19}]
["Q1","Q1 2018-19","May","2018-19May","2018-19","May",534,312,14,0,4,10,30,60,208,10,10,2,385,341,48,363,204,22,312,221,22,null,null,null,470,339,20,4,3,13,32,64,223,9,9,1,1456,942,44,6,10,28,90,180,628,29,29,6,1067,813,100,1100,761,87,1029,543,70,0,0,0,1559,1020,56,13,16,27,97,193,674,24,24,9,2943,1971,99,15,21,63,187,375,1310,44,44,8,2091,1558,193,2281,1124,125,2006,998,128,0,0,0,{"$f":"CA9","v":6069},{"$f":"CB9","v":3991},{"$f":"CC9","v":227},{"$f":"CD9","v":30},{"$f":"CE9","v":65},{"$f":"CF9","v":132},{"$f":"CG9","v":378},{"$f":"CH9","v":754},{"$f":"CI9","v":2632},75,75,19]
["Q1","Q1 2018-19","Jun","2018-19June","2018-19","June",452,291,10,2,3,5,28,56,197,10,10,3,332,220,22,356,208,23,359,225,34,null,null,null,534,312,14,0,4,10,30,60,208,10,10,2,1456,942,44,6,10,28,90,180,628,29,29,6,1067,813,100,1100,761,87,1029,543,70,0,0,0,1559,1020,56,13,16,27,97,193,674,24,24,9,2943,1971,99,15,21,63,187,375,1310,44,44,8,2091,1558,193,2281,1124,125,2006,998,128,0,0,0,6069,3991,227,30,65,132,378,754,2632,75,75,19]
["Q2","Q2 2018-19","Jul","2018-19July","2018-19","July",510,325,22,2,7,13,30,61,212,3,3,1,304,297,33,397,57,7,326,195,27,null,null,null,452,291,10,2,3,5,28,56,197,10,10,3,{"$f":"SUM(G$23:G$25)","v":1487},1029,55,9,11,35,97,195,682,15,{"$f":"SUM(Q$23:Q$25)","v":15},2,1024,745,93,1181,363,38,977,455,{"$f":"SUM(AA$23:AA$25)","v":58},0,0,0,1456,942,44,6,10,28,90,180,628,29,29,6,2943,1971,99,15,21,63,187,375,1310,44,44,8,2091,1558,193,2281,1124,125,2006,998,128,0,0,0,6069,3991,227,30,65,132,378,754,2632,75,75,19]
["Q2","Q2 2018-19","Aug","2018-19August","2018-19","August",506,365,18,1,3,14,35,69,243,5,5,0,334,225,29,397,268,27,324,102,12,null,null,null,510,325,22,2,7,13,30,61,212,3,3,1,1487,1029,55,9,11,35,97,195,682,15,15,2,1024,745,93,1181,363,38,977,455,58,0,0,0,1456,942,44,6,10,28,90,180,628,29,29,6,2943,1971,99,15,21,63,187,375,1310,44,44,8,2091,1558,193,2281,1124,125,2006,998,128,0,0,0,6069,3991,227,30,65,132,378,754,2632,75,75,19]
["Q2","Q2 2018-19","Sep","2018-19September","2018-19","September",471,339,15,6,1,8,32,65,227,7,7,1,386,223,31,387,38,4,327,158,19,null,null,null,506,365,18,1,3,14,35,69,243,{"$f":"P24","v":5},5,0,1487,1029,55,9,11,35,97,195,682,15,15,2,1024,745,93,1181,363,38,977,455,58,0,0,0,1456,942,44,6,10,28,90,180,628,29,29,6,2943,1971,99,15,21,63,187,375,1310,44,44,8,2091,1558,193,2281,1124,125,2006,998,128,0,0,0,6069,3991,227,30,65,132,378,754,2632,75,75,19]
["Q3","Q3 2018-19","Oct","2018-19October","2018-19","October",null,null,null,null,null,null,null,null,null,null,null,null,null,null,null,null,null,null,null,null,null,null,null,null,471,339,15,6,1,8,32,65,227,7,7,1,{"$f":"SUM(G$26:G$28)","v":0},0,0,0,0,0,0,0,0,0,{"$f":"SUM(Q$26:Q$28)","v":0},0,0,0,0,0,0,0,0,0,{"$f":"SUM(AA$26:AA$28)","v":0},0,0,0,1487,1029,55,9,11,35,97,195,682,15,15,2,2943,1971,99,15,21,63,187,375,1310,44,44,8,2091,1558,193,2281,1124,125,2006,998,128,0,0,0,6069,3991,227,30,65,132,378,754,2632,75,75,19]
["Q3","Q3 2018-19","Nov","2018-19November","2018-19","November",null,null,null,null,null,null,null,null,null,null,null,null,null,null,null,null,null,null,null,null,null,null,null,null,0,0,0,0,0,0,0,0,0,0,0,0,0,0,0,0,0,0,0,0,0,0,0,0,0,0,0,0,0,0,0,0,0,0,0,0,1487,1029,55,9,11,35,97,195,682,{"$f":"AZ24","v":15},{"$f":"BA24","v":15},{"$f":"BB24","v":2},2943,1971,99,15,21,63,187,375,1310,44,44,8,2091,1558,193,2281,1124,125,2006,998,128,0,0,0,6069,3991,227,30,65,132,378,754,2632,75,75,19]
["Q3","Q3 2018-19","Dec","2018-19December","2018-19","December",null,null,null,null,null,null,null,null,null,null,null,null,null,null,null,null,null,null,null,null,null,null,null,null,0,0,0,0,0,0,0,0,0,0,0,0,0,0,0,0,0,0,0,0,0,0,0,0,0,0,0,0,0,0,0,0,0,0,0,0,1487,1029,55,9,11,35,97,195,682,15,15,2,2943,1971,99,15,21,63,187,375,1310,44,44,8,2091,1558,193,2281,1124,125,2006,998,128,0,0,0,6069,3991,227,30,65,132,378,754,2632,75,75,19]
["Q4","Q4 2018-19","Jan","2018-19January","2018-19","January",null,null,null,null,null,null,null,null,null,null,null,null,null,null,null,null,null,null,null,null,null,null,null,null,0,0,0,0,0,0,0,0,0,0,0,0,{"$f":"SUM(G$29:G$31)","v":0},0,0,0,0,0,0,0,0,0,{"$f":"SUM(Q$29:Q$31)","v":0},0,0,0,0,0,0,0,0,0,{"$f":"SUM(AA$29:AA$31)","v":0},0,0,0,0,0,0,0,0,0,0,0,0,0,0,0,2943,1971,99,15,21,63,187,375,1310,44,44,8,2091,1558,193,2281,1124,125,2006,998,128,0,0,0,6069,3991,227,30,65,132,378,754,2632,75,75,19]
["Q4","Q4 2018-19","Feb","2018-19February","2018-19","February",null,null,null,null,null,null,null,null,null,null,null,null,null,null,null,null,null,null,null,null,null,null,null,null,0,0,0,0,0,0,0,0,0,0,0,0,0,0,0,0,0,0,0,0,0,0,0,0,0,0,0,0,0,0,0,0,0,0,0,0,0,0,0,0,0,0,0,0,0,0,0,0,2943,1971,99,15,21,63,187,375,1310,44,44,8,2091,1558,193,2281,1124,125,2006,998,128,0,0,0,6069,3991,227,30,65,132,378,754,2632,75,75,19]
["Q4","Q4 2018-19","Mar","2018-19March","2018-19","March",null,null,null,null,null,null,null,null,null,null,null,null,null,null,null,null,null,null,null,null,null,null,null,null,0,0,0,0,0,0,0,0,0,0,0,0,0,0,0,0,0,0,0,0,0,0,0,0,0,0,0,0,0,0,0,0,0,0,0,0,0,0,0,0,0,0,0,0,0,0,0,0,2943,1971,99,15,21,63,187,375,1310,44,44,8,2091,1558,193,2281,1124,125,2006,998,128,0,0,0,6069,3991,227,30,65,132,378,754,2632,75,75,19]
["Q1","Q1 2019-20","Apr, 19-20","2019-20April","2019-20","April",null,null,null,null,null,null,null,null,null,null,null,null,null,null,null,null,null,null,null,null,null,null,null,null,0,0,0,0,0,0,0,0,0,0,0,0,{"$f":"SUM(G$32:G$34)","v":0},0,0,0,0,0,0,0,0,0,{"$f":"SUM(Q$32:Q$34)","v":0},0,0,0,0,0,0,0,0,0,{"$f":"SUM(AA$32:AA$34)","v":0},0,0,0,0,0,0,0,0,0,0,0,0,0,0,0,{"$f":"SUM(G$32:G$43)","v":0},{"$f":"SUM(H$32:H$43)","v":0},{"$f":"SUM(I$32:I$43)","v":0},{"$f":"SUM(J$32:J$43)","v":0},{"$f":"SUM(K$32:K$43)","v":0},{"$f":"SUM(L$32:L$43)","v":0},{"$f":"SUM(M$32:M$43)","v":0},{"$f":"SUM(N$32:N$43)","v":0},{"$f":"SUM(O$32:O$43)","v":0},{"$f":"SUM(P$32:P$43)","v":0},0,0,{"$f":"SUM(S$32:S$43)","v":0},{"$f":"SUM(T$32:T$43)","v":0},{"$f":"SUM(U$32:U$43)","v":0},{"$f":"SUM(V$32:V$43)","v":0},{"$f":"SUM(W$32:W$43)","v":0},{"$f":"SUM(X$32:X$43)","v":0},{"$f":"SUM(Y$32:Y$43)","v":0},{"$f":"SUM(Z$32:Z$43)","v":0},{"$f":"SUM(AA$32:AA$43)","v":0},{"$f":"SUM(AB$32:AB$43)","v":0},{"$f":"SUM(AC$32:AC$43)","v":0},{"$f":"SUM(AD$32:AD$43)","v":0},2943,1971,99,15,21,63,187,375,1310,44,44,8]
["Q1","Q1 2019-20","May","2019-20May","2019-20","May",null,null,null,null,null,null,null,null,null,null,null,null,null,null,null,null,null,null,null,null,null,null,null,null,0,0,0,0,0,0,0,0,0,0,0,0,0,0,0,0,0,0,0,0,0,0,0,0,0,0,0,0,0,0,0,0,0,0,0,0,0,0,0,0,0,0,0,0,0,0,0,0,0,0,0,0,0,0,0,0,0,0,0,0,0,0,0,0,0,0,0,0,0,0,0,0,2943,1971,99,15,21,63,187,375,1310,44,44,8]
["Q1","Q1 2019-20","Jun","2019-20June","2019-20","June",null,null,null,null,null,null,null,null,null,null,null,null,null,null,null,null,null,null,null,null,null,null,null,null,0,0,0,0,0,0,0,0,0,0,0,0,0,0,0,0,0,0,0,0,0,0,0,0,0,0,0,0,0,0,0,0,0,0,0,0,0,0,0,0,0,0,0,0,0,0,0,0,0,0,0,0,0,0,0,0,0,0,0,0,0,0,0,0,0,0,0,0,0,0,0,0,2943,1971,99,15,21,63,187,375,1310,44,44,8]
["Q2","Q2 2019-20","Jul","2019-20July","2019-20","July",null,null,null,null,null,null,null,null,null,null,null,null,null,null,null,null,null,null,null,null,null,null,null,null,0,0,0,0,0,0,0,0,0,0,0,0,{"$f":"SUM(G$35:G$37)","v":0},0,0,0,0,0,0,0,0,0,{"$f":"SUM(Q$35:Q$37)","v":0},0,0,0,0,0,0,0,0,0,{"$f":"SUM(AA$35:AA$37)","v":0},0,0,0,0,0,0,0,0,0,0,0,0,0,0,0,0,0,0,0,0,0,0,0,0,0,0,0,0,0,0,0,0,0,0,0,0,0,0,0,2943,1971,99,15,21,63,187,375,1310,44,44,8]
["Q2","Q2 2019-20","Aug","2019-20August","2019-20","August",null,null,null,null,null,null,null,null,null,null,null,null,null,null,null,null,null,null,null,null,null,null,null,null,0,0,0,0,0,0,0,0,0,0,0,0,0,0,0,0,0,0,0,0,0,0,0,0,0,0,0,0,0,0,0,0,0,0,0,0,0,0,0,0,0,0,0,0,0,0,0,0,0,0,0,0,0,0,0,0,0,0,0,0,0,0,0,0,0,0,0,0,0,0,0,0,2943,1971,99,15,21,63,187,375,1310,44,44,8]
["Q2","Q2 2019-20","Sep","2019-20September","2019-20","September",null,null,null,null,null,null,null,null,null,null,null,null,null,null,null,null,null,null,null,null,null,null,null,null,0,0,0,0,0,0,0,0,0,0,0,0,0,0,0,0,0,0,0,0,0,0,0,0,0,0,0,0,0,0,0,0,0,0,0,0,0,0,0,0,0,0,0,0,0,0,0,0,0,0,0,0,0,0,0,0,0,0,0,0,0,0,0,0,0,0,0,0,0,0,0,0,2943,1971,99,15,21,63,187,375,1310,44,44,8]
["Q3","Q3 2019-20","Oct","2019-20October","2019-20","October",null,null,null,null,null,null,null,null,null,null,null,null,null,null,null,null,null,null,null,null,null,null,null,null,0,0,0,0,0,0,0,0,0,0,0,0,{"$f":"SUM(G$38:G$40)","v":0},0,0,0,0,0,0,0,0,0,{"$f":"SUM(Q$38:Q$40)","v":0},0,0,0,0,0,0,0,0,0,{"$f":"SUM(AA$38:AA$40)","v":0},0,0,0,0,0,0,0,0,0,0,0,0,0,0,0,0,0,0,0,0,0,0,0,0,0,0,0,0,0,0,0,0,0,0,0,0,0,0,0,2943,1971,99,15,21,63,187,375,1310,44,44,8]
["Q3","Q3 2019-20","Nov","2019-20November","2019-20","November",null,null,null,null,null,null,null,null,null,null,null,null,null,null,null,null,null,null,null,null,null,null,null,null,0,0,0,0,0,0,0,0,0,0,0,0,0,0,0,0,0,0,0,0,0,0,0,0,0,0,0,0,0,0,0,0,0,0,0,0,0,0,0,0,0,0,0,0,0,0,0,0,0,0,0,0,0,0,0,0,0,0,0,0,0,0,0,0,0,0,0,0,0,0,0,0,2943,1971,99,15,21,63,187,375,1310,44,44,8]
["Q3","Q3 2019-20","Dec","2019-20December","2019-20","December",null,null,null,null,null,null,null,null,null,null,null,null,null,null,null,null,null,null,null,null,null,null,null,null,{"$f":"G39","v":0},0,0,0,0,0,0,0,0,0,0,0,0,0,0,0,0,0,0,0,0,0,0,0,0,0,0,0,0,0,0,0,0,0,0,0,0,0,0,0,0,0,0,0,0,0,0,0,0,0,0,0,0,0,0,0,0,0,0,0,0,0,0,0,0,0,0,0,0,0,0,0,2943,1971,99,15,21,63,187,375,1310,44,44,8]
["Q4","Q4 2019-20","Jan","2019-20January","2019-20","January",null,null,null,null,null,null,null,null,null,null,null,null,null,null,null,null,null,null,null,null,null,null,null,null,0,0,0,0,0,0,0,0,{"$f":"O40","v":0},{"$f":"P40","v":0},0,0,{"$f":"SUM(G$41:G$43)","v":0},0,0,0,0,0,0,0,0,0,{"$f":"SUM(Q$41:Q$43)","v":0},0,0,0,0,0,0,0,0,0,{"$f":"SUM(AA$41:AA$43)","v":0},0,0,0,0,0,0,0,0,0,0,0,0,0,0,0,0,0,0,0,0,0,0,0,0,0,0,0,0,0,0,0,0,0,0,0,0,0,0,0,2943,1971,99,15,21,63,187,375,1310,44,44,8]
["Q4","Q4 2019-20","Feb","2019-20February","2019-20","February",null,null,null,null,null,null,null,null,null,null,null,null,null,null,null,null,null,null,null,null,null,null,null,null,0,0,0,0,0,0,0,0,0,0,0,0,0,0,0,0,0,0,0,0,0,0,0,0,0,0,0,0,0,0,0,0,0,0,0,0,0,0,0,0,0,0,0,0,0,0,0,0,0,0,0,0,0,0,0,0,0,0,0,0,0,0,0,0,0,0,0,0,0,0,0,0,2943,1971,99,15,21,63,187,375,1310,44,44,8]
["Q4","Q4 2019-20","Mar","2019-20March","2019-20","March",null,null,null,null,null,null,null,null,null,null,null,null,null,null,null,null,null,null,null,null,null,null,null,null,0,0,0,0,0,0,0,0,0,0,0,0,0,0,0,0,0,0,0,0,0,0,0,0,0,0,0,0,0,0,0,0,0,0,0,0,0,0,0,0,0,0,0,0,0,0,0,0,0,0,0,0,0,0,0,0,0,0,0,0,0,0,0,0,0,0,0,0,0,0,0,0,2943,1971,99,15,21,63,187,375,1310,44,44,8]
["Q1","Q1 2020-21","Apr, 20-21","2020-21April","2020-21","April",null,null,null,null,null,null,null,null,null,null,null,null,null,null,null,null,null,null,null,null,null,null,null,null,0,0,0,0,0,0,0,0,0,0,0,0,{"$f":"SUM(G$44:G$46)","v":0},0,0,0,0,0,0,0,0,0,{"$f":"SUM(Q$44:Q$46)","v":0},0,0,0,0,0,0,0,0,0,{"$f":"SUM(AA$44:AA$46)","v":0},0,0,0,0,0,0,0,0,0,0,0,0,0,0,0,{"$f":"SUM(G$44:G$55)","v":0},{"$f":"SUM(H$44:H$55)","v":0},{"$f":"SUM(I$44:I$55)","v":0},{"$f":"SUM(J$44:J$55)","v":0},{"$f":"SUM(K$44:K$55)","v":0},{"$f":"SUM(L$44:L$55)","v":0},{"$f":"SUM(M$44:M$55)","v":0},{"$f":"SUM(N$44:N$55)","v":0},{"$f":"SUM(O$44:O$55)","v":0},{"$f":"SUM(P$44:P$55)","v":0},0,0,{"$f":"SUM(S$44:S$55)","v":0},{"$f":"SUM(T$44:T$55)","v":0},{"$f":"SUM(U$44:U$55)","v":0},{"$f":"SUM(V$44:V$55)","v":0},{"$f":"SUM(W$44:W$55)","v":0},{"$f":"SUM(X$44:X$55)","v":0},{"$f":"SUM(Y$44:Y$55)","v":0},{"$f":"SUM(Z$44:Z$55)","v":0},{"$f":"SUM(AA$44:AA$55)","v":0},{"$f":"SUM(AB$44:AB$55)","v":0},{"$f":"SUM(AC$44:AC$55)","v":0},{"$f":"SUM(AD$44:AD$55)","v":0},0,0,0,0,0,0,0,0,0,0,0,0]
["Q1","Q1 2020-21","May","2020-21May","2020-21","May",null,null,null,null,null,null,null,null,null,null,null,null,null,null,null,null,null,null,null,null,null,null,null,null,0,0,0,0,0,0,0,0,0,0,0,0,0,0,0,0,0,0,0,0,0,0,0,0,0,0,0,0,0,0,0,0,0,0,0,0,0,0,0,0,0,0,0,0,0,0,0,0,0,0,0,0,0,0,0,0,0,0,0,0,0,0,0,0,0,0,0,0,0,0,0,0,0,0,0,0,0,0,0,0,0,0,0,0]
["Q1","Q1 2020-21","Jun","2020-21June","2020-21","June",null,null,null,null,null,null,null,null,null,null,null,null,null,null,null,null,null,null,null,null,null,null,null,null,0,0,0,0,0,0,0,0,0,0,0,0,0,0,0,0,0,0,0,0,0,0,0,0,0,0,0,0,0,0,0,0,0,0,0,0,0,0,0,0,0,0,0,0,0,0,0,0,0,0,0,0,0,0,0,0,0,0,0,0,0,0,0,0,0,0,0,0,0,0,0,0,0,0,0,0,0,0,0,0,0,0,0,0]
["Q2","Q2 2020-21","Jul","2020-21July","2020-21","July",null,null,null,null,null,null,null,null,null,null,null,null,null,null,null,null,null,null,null,null,null,null,null,null,0,0,0,0,0,0,0,0,0,0,0,0,{"$f":"SUM(G$47:G$49)","v":0},0,0,0,0,0,0,0,0,0,{"$f":"SUM(Q$47:Q$49)","v":0},0,0,0,0,0,0,0,0,0,{"$f":"SUM(AA$47:AA$49)","v":0},0,0,0,0,0,0,0,0,0,0,0,0,0,0,0,0,0,0,0,0,0,0,0,0,0,0,0,0,0,0,0,0,0,0,0,0,0,0,0,0,0,0,0,0,0,0,0,0,0,0,0]
["Q2","Q2 2020-21","Aug","2020-21August","2020-21","August",null,null,null,null,null,null,null,null,null,null,null,null,null,null,null,null,null,null,null,null,null,null,null,null,0,0,0,0,0,0,0,0,0,0,0,0,0,0,0,0,0,0,0,0,0,0,0,0,0,0,0,0,0,0,0,0,0,0,0,0,0,0,0,0,0,0,0,0,0,0,0,0,0,0,0,0,0,0,0,0,0,0,0,0,0,0,0,0,0,0,0,0,0,0,0,0,0,0,0,0,0,0,0,0,0,0,0,0]
["Q2","Q2 2020-21","Sep","2020-21September","2020-21","September",null,null,null,null,null,null,null,null,null,null,null,null,null,null,null,null,null,null,null,null,null,null,null,null,0,0,0,0,0,0,0,0,0,0,0,0,0,0,0,0,0,0,0,0,0,0,0,0,0,0,0,0,0,0,0,0,0,0,0,0,0,0,0,0,0,0,0,0,0,0,0,0,0,0,0,0,0,0,0,0,0,0,0,0,0,0,0,0,0,0,0,0,0,0,0,0,0,0,0,0,0,0,0,0,0,0,0,0]
["Q3","Q3 2020-21","Oct","2020-21October","2020-21","October",null,null,null,null,null,null,null,null,null,null,null,null,null,null,null,null,null,null,null,null,null,null,null,null,0,0,0,0,0,0,0,0,0,0,0,0,{"$f":"SUM(G$50:G$52)","v":0},0,0,0,0,0,0,0,0,0,{"$f":"SUM(Q$50:Q$52)","v":0},0,0,0,0,0,0,0,0,0,{"$f":"SUM(AA$50:AA$52)","v":0},0,0,0,0,0,0,0,0,0,0,0,0,0,0,0,0,0,0,0,0,0,0,0,0,0,0,0,0,0,0,0,0,0,0,0,0,0,0,0,0,0,0,0,0,0,0,0,0,0,0,0]
["Q3","Q3 2020-21","Nov","2020-21November","2020-21","November",null,null,null,null,null,null,null,null,null,null,null,null,null,null,null,null,null,null,null,null,null,null,null,null,0,0,0,0,0,0,0,0,0,0,0,0,0,0,0,0,0,0,0,0,0,0,0,0,0,0,0,0,0,0,0,0,0,0,0,0,0,0,0,0,0,0,0,0,0,0,0,0,0,0,0,0,0,0,0,0,0,0,0,0,0,0,0,0,0,0,0,0,0,0,0,0,0,0,0,0,0,0,0,0,0,0,0,0]
["Q3","Q3 2020-21","Dec","2020-21December","2020-21","December",null,null,null,null,null,null,null,null,null,null,null,null,null,null,null,null,null,null,null,null,null,null,null,null,0,0,0,0,0,0,0,0,0,0,0,0,0,0,0,0,0,0,0,0,0,0,0,0,0,0,0,0,0,0,0,0,0,0,0,0,0,0,0,0,0,0,0,0,0,0,0,0,0,0,0,0,0,0,0,0,0,0,0,0,0,0,0,0,0,0,0,0,0,0,0,0,0,0,0,0,0,0,0,0,0,0,0,0]
["Q4","Q4 2020-21","Jan","2020-21January","2020-21","January",null,null,null,null,null,null,null,null,null,null,null,null,null,null,null,null,null,null,null,null,null,null,null,null,0,0,0,0,0,0,0,0,0,0,0,0,{"$f":"SUM(G$53:G$55)","v":0},0,0,0,0,0,0,0,0,0,{"$f":"SUM(Q$53:Q$55)","v":0},0,0,0,0,0,0,0,0,0,{"$f":"SUM(AA$53:AA$55)","v":0},0,0,0,0,0,0,0,0,0,0,0,0,0,0,0,0,0,0,0,0,0,0,0,0,0,0,0,0,0,0,0,0,0,0,0,0,0,0,0,0,0,0,0,0,0,0,0,0,0,0,0]
["Q4","Q4 2020-21","Feb","2020-21February","2020-21","February",null,null,null,null,null,null,null,null,null,null,null,null,null,null,null,null,null,null,null,null,null,null,null,null,0,0,0,0,0,0,0,0,0,0,0,0,0,0,0,0,0,0,0,0,0,0,0,0,0,0,0,0,0,0,0,0,0,0,0,0,0,0,0,0,0,0,0,0,0,0,0,0,0,0,0,0,0,0,0,0,0,0,0,0,0,0,0,0,0,0,0,0,0,0,0,0,0,0,0,0,0,0,0,0,0,0,0,0]
["Q4","Q4 2020-21","Mar","2020-21March","2020-21","March",null,null,null,null,null,null,null,null,null,null,null,null,null,null,null,null,null,null,null,null,null,null,null,null,0,0,0,0,0,0,0,0,0,0,0,0,0,0,0,0,0,0,0,0,0,0,0,0,0,0,0,0,0,0,0,0,0,0,0,0,0,0,0,0,0,0,0,0,0,0,0,0,0,0,0,0,0,0,0,0,0,0,0,0,0,0,0,0,0,0,0,0,0,0,0,0,0,0,0,0,0,0,0,0,0,0,0,0]
["Q1","Q1 2021-22","Apr, 21-22","2021-22April","2021-22","April",null,null,null,null,null,null,null,null,null,null,null,null,null,null,null,null,null,null,null,null,null,null,null,null,0,0,0,0,0,0,0,0,0,0,0,0,{"$f":"SUM(G$56:G$58)","v":0},0,0,0,0,0,0,0,0,0,{"$f":"SUM(Q$56:Q$58)","v":0},0,0,0,0,0,0,0,0,0,{"$f":"SUM(AA$56:AA$58)","v":0},0,0,0,0,0,0,0,0,0,0,0,0,0,0,0,{"$f":"SUM(G$56:G$67)","v":0},{"$f":"SUM(H$56:H$67)","v":0},{"$f":"SUM(I$56:I$67)","v":0},{"$f":"SUM(J$56:J$67)","v":0},{"$f":"SUM(K$56:K$67)","v":0},{"$f":"SUM(L$56:L$67)","v":0},{"$f":"SUM(M$56:M$67)","v":0},{"$f":"SUM(N$56:N$67)","v":0},{"$f":"SUM(O$56:O$67)","v":0},{"$f":"SUM(P$56:P$67)","v":0},0,0,{"$f":"SUM(S$56:S$67)","v":0},{"$f":"SUM(T$56:T$67)","v":0},{"$f":"SUM(U$56:U$67)","v":0},{"$f":"SUM(V$56:V$67)","v":0},{"$f":"SUM(W$56:W$67)","v":0},{"$f":"SUM(X$56:X$67)","v":0},{"$f":"SUM(Y$56:Y$67)","v":0},{"$f":"SUM(Z$56:Z$67)","v":0},{"$f":"SUM(AA$56:AA$67)","v":0},{"$f":"SUM(AB$56:AB$67)","v":0},{"$f":"SUM(AC$56:AC$67)","v":0},{"$f":"SUM(AD$56:AD$67)","v":0},0,0,0,0,0,0,0,0,0,0,0,0]
["Q1","Q1 2021-22","May","2021-22May","2021-22","May",null,null,null,null,null,null,null,null,null,null,null,null,null,null,null,null,null,null,null,null,null,null,null,null,0,0,0,0,0,0,0,0,0,{"$f":"P56","v":0},0,0,0,0,0,0,0,0,0,0,0,0,0,0,0,0,0,0,0,0,0,0,0,0,0,0,0,0,0,0,0,0,0,0,0,0,0,0,0,0,0,0,0,0,0,0,0,0,0,0,0,0,0,0,0,0,0,0,0,0,0,0,0,0,0,0,0,0,0,0,0,0,0,0]
["Q1","Q1 2021-22","Jun","2021-22June","2021-22","June",null,null,null,null,null,null,null,null,null,null,null,null,null,null,null,null,null,null,null,null,null,null,null,null,0,0,0,0,0,0,0,0,0,0,0,0,0,0,0,0,0,0,0,0,0,0,0,0,0,0,0,0,0,0,0,0,0,0,0,0,0,0,0,0,0,0,0,0,0,0,0,0,0,0,0,0,0,0,0,0,0,0,0,0,0,0,0,0,0,0,0,0,0,0,0,0,0,0,0,0,0,0,0,0,0,0,0,0]
["Q2","Q2 2021-22","Jul","2021-22July","2021-22","July",null,null,null,null,null,null,null,null,null,null,null,null,null,null,null,null,null,null,null,null,null,null,null,null,0,0,0,0,0,0,0,0,0,0,0,0,{"$f":"SUM(G$59:G$61)","v":0},0,0,0,0,0,0,0,0,0,{"$f":"SUM(Q$59:Q$61)","v":0},0,0,0,0,0,0,0,0,0,{"$f":"SUM(AA$59:AA$61)","v":0},0,0,0,{"$f":"AQ56","v":0},0,0,0,0,0,0,0,0,0,0,0,0,0,0,0,0,0,0,0,0,0,0,0,0,0,0,0,0,0,0,0,0,0,0,0,0,0,0,0,0,0,0,0,0,0,0,0]
["Q2","Q2 2021-22","Aug","2021-22August","2021-22","August",null,null,null,null,null,null,null,null,null,null,null,null,null,null,null,null,null,null,null,null,null,null,null,null,0,0,0,0,0,0,0,0,0,0,0,0,0,0,0,0,0,0,0,0,0,0,0,0,0,0,0,0,0,0,0,0,0,0,0,0,{"$f":"AQ57","v":0},{"$f":"AR57","v":0},{"$f":"AS57","v":0},{"$f":"AT57","v":0},{"$f":"AU57","v":0},{"$f":"AV57","v":0},{"$f":"AW57","v":0},{"$f":"AX57","v":0},{"$f":"AY57","v":0},0,0,0,0,0,0,0,0,0,0,0,0,0,0,0,0,0,0,0,0,0,0,0,0,0,0,0,0,0,0,0,0,0,0,0,0,0,0,0]
["Q2","Q2 2021-22","Sep","2021-22September","2021-22","September",null,null,null,null,null,null,null,null,null,null,null,null,null,null,null,null,null,null,null,null,null,null,null,null,0,0,0,0,0,0,0,0,0,0,0,0,0,0,0,0,0,0,0,0,0,0,0,0,0,0,0,0,0,0,0,0,0,0,0,0,0,0,0,0,0,0,0,0,0,0,0,0,0,0,0,0,0,0,0,0,0,0,0,0,0,0,0,0,0,0,0,0,0,0,0,0,0,0,0,0,0,0,0,0,0,0,0,0]
["Q3","Q3 2021-22","Oct","2021-22October","2021-22","October",null,null,null,null,null,null,null,null,null,null,null,null,null,null,null,null,null,null,null,null,null,null,null,null,0,0,0,0,0,0,0,0,0,0,0,0,{"$f":"SUM(G$62:G$64)","v":0},0,0,0,0,0,0,0,0,0,{"$f":"SUM(Q$62:Q$64)","v":0},0,0,0,0,0,0,0,0,0,{"$f":"SUM(AA$62:AA$64)","v":0},0,0,0,0,0,0,0,0,0,0,0,0,0,0,0,0,0,0,0,0,0,0,0,0,0,0,0,0,0,0,0,0,0,0,0,0,0,0,0,0,0,0,0,0,0,0,0,0,0,0,0]
["Q3","Q3 2021-22","Nov","2021-22November","2021-22","November",null,null,null,null,null,null,null,null,null,null,null,null,null,null,null,null,null,null,null,null,null,null,null,null,0,0,0,0,0,0,0,0,0,0,0,0,0,0,0,0,0,0,0,0,0,0,0,0,0,0,0,0,0,0,0,0,0,0,0,0,0,0,0,0,0,0,0,0,0,0,0,0,0,0,0,0,0,0,0,0,0,0,0,0,0,0,0,0,0,0,0,0,0,0,0,0,0,0,0,0,0,0,0,0,0,0,0,0]
["Q3","Q3 2021-22","Dec","2021-22December","2021-22","December",null,null,null,null,null,null,null,null,null,null,null,null,null,null,null,null,null,null,null,null,null,null,null,null,0,0,0,0,0,0,0,0,0,0,0,0,0,0,0,0,0,0,0,0,0,0,0,0,0,0,0,0,0,0,0,0,0,0,0,0,0,0,0,0,0,0,0,0,0,0,0,0,0,0,0,0,0,0,0,0,0,0,0,0,0,0,0,0,0,0,0,0,0,0,0,0,0,0,0,0,0,0,0,0,0,0,0,0]
["Q4","Q4 2021-22","Jan","2021-22January","2021-22","January",null,null,null,null,null,null,null,null,null,null,null,null,null,null,null,null,null,null,null,null,null,null,null,null,0,0,0,0,0,0,0,0,0,0,0,0,{"$f":"SUM(G$65:G$67)","v":0},0,0,0,0,0,0,0,0,0,{"$f":"SUM(Q$65:Q$67)","v":0},0,0,0,0,0,0,0,0,0,{"$f":"SUM(AA$65:AA$67)","v":0},0,0,0,0,0,0,0,0,0,0,0,0,0,0,0,0,0,0,0,0,0,0,0,0,0,0,0,0,0,0,0,0,0,0,0,0,0,0,0,0,0,0,0,0,0,0,0,0,0,0,0]
["Q4","Q4 2021-22","Feb","2021-22February","2021-22","February",null,null,null,null,null,null,null,null,null,null,null,null,null,null,null,null,null,null,null,null,null,null,null,null,0,0,0,0,0,0,0,0,0,0,0,0,0,0,0,0,0,0,0,0,0,0,0,0,0,0,0,0,0,0,0,0,0,0,0,0,0,0,0,0,0,0,0,0,0,0,0,0,0,0,0,0,0,0,0,0,0,0,0,0,0,0,0,0,0,0,0,0,0,0,0,0,0,0,0,0,0,0,0,0,0,0,0,0]
["Q4","Q4 2021-22","Mar","2021-22March","2021-22","March",null,null,null,null,null,null,null,null,null,null,null,null,null,null,null,null,null,null,null,null,null,null,null,null,0,0,0,0,0,0,0,0,0,0,0,0,0,0,0,0,0,0,0,0,0,0,0,0,0,0,0,0,0,0,0,0,0,0,0,0,0,0,0,0,0,0,0,0,0,0,0,0,0,0,0,0,0,0,0,0,0,0,0,0,0,0,0,0,0,0,0,0,0,0,0,0,0,0,0,0,0,0,0,0,0,0,0,0]
["Q1","Q1 2022-23","Apr, 21-22","2022-23April","2022-23","April",null,null,null,null,null,null,null,null,null,null,null,null,null,null,null,null,null,null,null,null,null,null,null,null,0,{"$f":"H67","v":0},{"$f":"I67","v":0},{"$f":"J67","v":0},{"$f":"K67","v":0},{"$f":"L67","v":0},{"$f":"M67","v":0},{"$f":"N67","v":0},0,0,0,0,{"$f":"SUM(G$68:G$70)","v":0},0,0,0,0,0,0,0,0,{"$f":"SUM(P$68:P$70)","v":0},{"$f":"SUM(Q$68:Q$70)","v":0},{"$f":"SUM(R$68:R$70)","v":0},{"$f":"SUM(S$68:S$70)","v":0},0,0,0,0,0,0,0,0,0,0,0,{"$f":"AQ65","v":0},{"$f":"AR65","v":0},{"$f":"AS65","v":0},{"$f":"AT65","v":0},{"$f":"AU65","v":0},{"$f":"AV65","v":0},{"$f":"AW65","v":0},{"$f":"AX65","v":0},{"$f":"AY65","v":0},0,0,0,{"$f":"SUM(G$68:G$79)","v":0},0,0,0,0,0,0,0,0,{"$f":"SUM(P$68:P$79)","v":0},{"$f":"SUM(Q$68:Q$79)","v":0},{"$f":"SUM(R$68:R$79)","v":0},{"$f":"SUM(S$68:S$79)","v":0},0,0,0,0,0,0,0,0,0,0,0,{"$f":"CA56","v":0},{"$f":"CB56","v":0},{"$f":"CC56","v":0},{"$f":"CD56","v":0},{"$f":"CE56","v":0},{"$f":"CF56","v":0},{"$f":"CG56","v":0},{"$f":"CH56","v":0},{"$f":"CI56","v":0},0,0,0]
["Q1","Q1 2022-23","May","2022-23May","2022-23","May",null,null,null,null,null,null,null,null,null,null,null,null,null,null,null,null,null,null,null,null,null,null,null,null,0,0,0,0,0,0,0,0,0,0,0,0,0,0,0,0,0,0,0,0,0,0,0,0,0,0,0,0,0,0,0,0,0,0,0,0,0,0,0,0,0,0,0,0,0,0,0,0,{"$f":"SUM(G$68:G$79)","v":0},{"$f":"SUM(H$68:H$79)","v":0},{"$f":"SUM(I$68:I$79)","v":0},{"$f":"SUM(J$68:J$79)","v":0},{"$f":"SUM(K$68:K$79)","v":0},{"$f":"SUM(L$68:L$79)","v":0},{"$f":"SUM(M$68:M$79)","v":0},{"$f":"SUM(N$68:N$79)","v":0},{"$f":"SUM(O$68:O$79)","v":0},0,0,0,{"$f":"SUM(S$68:S$79)","v":0},{"$f":"SUM(T$68:T$79)","v":0},{"$f":"SUM(U$68:U$79)","v":0},{"$f":"SUM(V$68:V$79)","v":0},{"$f":"SUM(W$68:W$79)","v":0},{"$f":"SUM(X$68:X$79)","v":0},{"$f":"SUM(Y$68:Y$79)","v":0},{"$f":"SUM(Z$68:Z$79)","v":0},{"$f":"SUM(AA$68:AA$79)","v":0},{"$f":"SUM(AB$68:AB$79)","v":0},{"$f":"SUM(AC$68:AC$79)","v":0},{"$f":"SUM(AD$68:AD$79)","v":0},0,0,0,0,0,0,0,0,0,0,0,0]
["Q1","Q1 2022-23","Jun","2022-23June","2022-23","June",null,null,null,null,null,null,null,null,null,null,null,null,null,null,null,null,null,null,null,null,null,null,null,null,0,0,0,0,0,0,0,0,0,0,0,0,0,0,0,0,0,0,0,0,0,0,0,0,0,0,0,0,0,0,0,0,0,0,0,0,0,0,0,0,0,0,0,0,0,0,0,0,0,0,0,0,0,0,0,0,0,0,0,0,0,0,0,0,0,0,0,0,0,0,0,0,0,0,0,0,0,0,0,0,0,0,0,0]
["Q2","Q2 2022-23","Jul","2022-23July","2022-23","July",null,null,null,null,null,null,null,null,null,null,null,null,null,null,null,null,null,null,null,null,null,null,null,null,0,0,0,0,0,0,0,0,0,0,0,0,{"$f":"SUM(G$71:G$73)","v":0},0,0,0,0,0,0,0,0,{"$f":"SUM(P$71:P$73)","v":0},{"$f":"SUM(Q$71:Q$73)","v":0},{"$f":"SUM(R$71:R$73)","v":0},{"$f":"SUM(S$71:S$73)","v":0},0,0,0,0,0,0,0,0,0,0,0,0,0,0,0,0,0,0,0,0,0,0,0,0,0,0,0,0,0,0,0,0,0,0,0,0,0,0,0,0,0,0,0,0,0,0,0,0,0,0,0,0,0,0,0,0,0,0,0]
["Q2","Q2 2022-23","Aug","2022-23August","2022-23","August",null,null,null,null,null,null,null,null,null,null,null,null,null,null,null,null,null,null,null,null,null,null,null,null,0,0,0,0,0,0,0,0,0,0,0,0,0,0,0,0,0,0,0,0,0,0,0,0,0,0,0,0,0,0,0,0,0,0,0,0,0,0,0,0,0,0,0,0,0,0,0,0,0,0,0,0,0,0,0,0,0,0,0,0,0,0,0,0,0,0,0,0,0,0,0,0,0,0,0,0,0,0,0,0,0,0,0,0]
["Q2",{"$f":"A73&\" \"&E73","v":"Q2 2022-23"},"Sep",{"$f":"E73&F73","v":"2022-23September"},"2022-23","September",null,null,null,null,null,null,null,null,null,null,null,null,null,null,null,null,null,null,null,null,null,null,null,null,0,0,0,0,0,0,0,0,{"$f":"O72","v":0},{"$f":"P72","v":0},0,0,0,0,0,0,0,0,0,0,0,0,0,0,0,0,0,0,0,0,0,0,0,0,0,0,0,0,0,0,0,0,0,0,0,0,0,0,0,0,0,0,0,0,0,0,0,0,0,0,0,0,0,0,0,0,0,0,0,0,0,0,0,0,0,0,0,0,0,0,0,0,0,0]
["Q3","Q3 2022-23","Oct","2022-23October","2022-23","October",null,null,null,null,null,null,null,null,null,null,null,null,null,null,null,null,null,null,null,null,null,null,null,null,{"$f":"G73","v":0},0,0,0,0,0,0,0,0,0,0,0,{"$f":"SUM(G$74:G$76)","v":0},0,0,0,0,0,0,0,0,{"$f":"SUM(P$74:P$76)","v":0},{"$f":"SUM(Q$74:Q$76)","v":0},{"$f":"SUM(R$74:R$76)","v":0},{"$f":"SUM(S$74:S$76)","v":0},0,0,0,0,0,0,0,0,0,0,0,0,0,0,0,0,0,0,0,0,0,0,0,0,0,0,0,0,0,0,0,0,0,0,0,0,0,0,0,0,0,0,0,0,0,0,0,0,0,0,0,0,0,0,0,0,0,0,0]
["Q3","Q3 2022-23","Nov","2022-23November","2022-23","November",null,null,null,null,null,null,null,null,null,null,null,null,null,null,null,null,null,null,null,null,null,null,null,null,0,0,0,0,0,0,0,0,0,0,0,0,0,0,0,0,0,0,0,0,0,0,0,0,0,0,0,0,0,0,0,0,0,0,0,0,0,0,0,0,0,0,0,0,0,0,0,0,0,0,0,0,0,0,0,0,0,0,0,0,0,0,0,0,0,0,0,0,0,0,0,0,0,0,0,0,0,0,0,0,0,0,0,0]
["Q3","Q3 2022-23","Dec","2022-23December","2022-23","December",null,null,null,null,null,null,null,null,null,null,null,null,null,null,null,null,null,null,null,null,null,null,null,null,0,0,0,0,0,0,0,0,0,0,0,0,0,0,0,0,0,0,0,0,0,0,0,0,0,0,0,0,0,0,0,0,0,0,0,0,0,0,0,0,0,0,0,0,0,0,0,0,0,0,0,0,0,0,0,0,0,0,0,0,0,0,0,0,0,0,0,0,0,0,0,0,0,0,0,0,0,0,0,0,0,0,0,0]
["Q4","Q4 2022-23","Jan","2022-23January","2022-23","January",null,null,null,null,null,null,null,null,null,null,null,null,null,null,null,null,null,null,null,null,null,null,null,null,0,0,0,0,0,0,0,0,0,0,0,0,{"$f":"SUM(G$77:G$79)","v":0},0,0,0,0,0,0,0,0,{"$f":"SUM(P$77:P$79)","v":0},{"$f":"SUM(Q$77:Q$79)","v":0},{"$f":"SUM(R$77:R$79)","v":0},{"$f":"SUM(S$77:S$79)","v":0},0,0,0,0,0,0,0,0,0,0,0,0,0,0,0,0,0,0,0,0,0,0,0,0,0,0,0,0,0,0,0,0,0,0,0,0,0,0,0,0,0,0,0,0,0,0,0,0,0,0,0,0,0,0,0,0,0,0,0]
["Q4","Q4 2022-23","Feb","2022-23February","2022-23","February",null,null,null,null,null,null,null,null,null,null,null,null,null,null,null,null,null,null,null,null,null,null,null,null,0,0,0,0,0,0,0,0,0,0,0,0,0,0,0,0,0,0,0,0,0,0,0,0,0,0,0,0,0,0,0,0,0,0,0,0,0,0,0,0,0,0,0,0,0,0,0,0,0,0,0,0,0,0,0,0,0,0,0,0,0,0,0,0,0,0,0,0,0,0,0,0,0,0,0,0,0,0,0,0,0,0,0,0]
["Q4","Q4 2022-23","Mar","2022-23March","2022-23","March",null,null,null,null,null,null,null,null,null,null,null,null,null,null,null,null,null,null,null,null,null,null,null,null,0,0,0,0,0,0,0,0,0,0,0,0,0,0,0,0,0,0,0,0,0,0,0,0,0,0,0,0,0,0,0,0,0,0,0,0,0,0,0,0,0,0,0,0,0,0,0,0,{"$f":"SUM(G$68:G$79)","v":0},0,0,0,0,0,0,0,0,0,0,0,0,0,0,0,0,0,{"$f":"SUM(Y$68:Y$79)","v":0},0,0,0,0,0,0,0,0,0,0,0,0,0,0,0,0,0]
["Q1","Q1 2023-24","Apr, 21-22","2023-24April","2023-24","April",null,null,null,null,null,null,null,null,null,null,null,null,null,null,null,null,null,null,null,null,null,null,null,null,0,0,0,0,0,0,0,0,0,0,0,0,{"$f":"SUM(G$80:G$82)","v":0},0,0,0,0,0,0,0,0,{"$f":"SUM(P$80:P$82)","v":0},{"$f":"SUM(Q$80:Q$82)","v":0},{"$f":"SUM(R$80:R$82)","v":0},{"$f":"SUM(S$80:S$82)","v":0},0,0,0,0,0,0,0,0,0,0,0,0,0,0,0,0,0,0,0,0,0,0,0,{"$f":"SUM(G$80:G$91)","v":0},0,0,0,0,0,0,0,0,{"$f":"SUM(P$80:P$91)","v":0},{"$f":"SUM(Q$80:Q$91)","v":0},{"$f":"SUM(R$80:R$91)","v":0},{"$f":"SUM(S$80:S$91)","v":0},0,0,0,0,0,{"$f":"SUM(Y$80:Y$91)","v":0},{"$f":"SUM(Z$80:Z$91)","v":0},{"$f":"SUM(AA$80:AA$91)","v":0},{"$f":"SUM(AB$80:AB$91)","v":0},{"$f":"SUM(AC$80:AC$91)","v":0},{"$f":"SUM(AD$80:AD$91)","v":0},0,0,0,0,0,0,0,0,0,0,0,0]
["Q1","Q1 2023-24","May","2023-24May","2023-24","May",null,null,null,null,null,null,null,null,null,null,null,null,null,null,null,null,null,null,null,null,null,null,null,null,0,0,0,0,0,0,0,0,0,0,0,0,0,0,0,0,0,0,0,0,0,0,0,0,0,0,0,0,0,0,0,0,0,0,0,0,0,0,0,0,0,0,0,0,0,0,0,0,{"$f":"SUM(G$80:G$91)","v":0},{"$f":"SUM(H$80:H$91)","v":0},{"$f":"SUM(I$80:I$91)","v":0},{"$f":"SUM(J$80:J$91)","v":0},{"$f":"SUM(K$80:K$91)","v":0},{"$f":"SUM(L$80:L$91)","v":0},{"$f":"SUM(M$80:M$91)","v":0},{"$f":"SUM(N$80:N$91)","v":0},{"$f":"SUM(O$80:O$91)","v":0},0,0,0,0,0,0,0,0,0,{"$f":"SUM(Y$80:Y$91)","v":0},0,0,0,0,0,0,0,0,0,0,0,0,0,0,0,0,0]
["Q1","Q1 2023-24","Jun","2023-24June","2023-24","June",null,null,null,null,null,null,null,null,null,null,null,null,null,null,null,null,null,null,null,null,null,null,null,null,0,0,0,0,0,0,0,0,0,0,0,0,0,0,0,0,0,0,0,0,0,0,0,0,0,0,0,0,0,0,0,0,0,0,0,0,0,0,0,0,0,0,0,0,0,0,0,0,0,0,0,0,0,0,0,0,0,0,0,0,0,0,0,0,0,0,0,0,0,0,0,0,0,0,0,0,0,0,0,0,0,0,0,0]
["Q2","Q2 2023-24","Jul","2023-24July","2023-24","July",null,null,null,null,null,null,null,null,null,null,null,null,null,null,null,null,null,null,null,null,null,null,null,null,0,0,0,0,0,0,0,0,0,0,0,0,{"$f":"SUM(G$83:G$85)","v":0},0,0,0,0,0,0,0,0,{"$f":"SUM(P$83:P$85)","v":0},{"$f":"SUM(Q$83:Q$85)","v":0},{"$f":"SUM(R$83:R$85)","v":0},{"$f":"SUM(S$83:S$85)","v":0},0,0,0,0,0,0,0,0,0,0,0,0,0,0,0,0,0,0,0,0,0,0,0,0,0,0,0,0,0,0,0,0,0,0,0,0,0,0,0,0,0,0,0,0,0,0,0,0,0,0,0,0,0,0,0,0,0,0,0]
["Q2","Q2 2023-24","Aug","2023-24August","2023-24","August",null,null,null,null,null,null,null,null,null,null,null,null,null,null,null,null,null,null,null,null,null,null,null,null,0,0,0,0,0,0,0,0,0,0,0,0,0,0,0,0,0,0,0,0,0,0,0,0,0,0,0,0,0,0,0,0,0,0,0,0,0,0,0,0,0,0,0,0,0,0,0,0,0,0,0,0,0,0,0,0,0,0,0,0,0,0,0,0,0,0,0,0,0,0,0,0,0,0,0,0,0,0,0,0,0,{"$f":"CJ72","v":0},{"$f":"CK72","v":0},{"$f":"CL72","v":0}]
["Q2","Q2 2023-24","Sep","2023-24September","2023-24","September",null,null,null,null,null,null,null,null,null,null,null,null,null,null,null,null,null,null,null,null,null,null,null,null,0,0,0,0,0,0,0,0,0,0,0,0,0,0,0,0,0,0,0,0,0,0,0,0,0,0,0,0,0,0,0,0,0,0,0,0,0,0,0,0,0,0,0,0,0,0,0,0,0,0,0,0,0,0,0,0,0,0,0,0,0,0,0,0,0,0,0,0,0,0,0,0,0,0,0,0,0,0,0,0,0,0,0,0]
["Q3","Q3 2023-24","Oct","2023-24October","2023-24","October",null,null,null,null,null,null,null,null,null,null,null,null,null,null,null,null,null,null,null,null,null,null,null,null,0,0,0,0,0,0,0,0,0,0,0,0,{"$f":"SUM(G$86:G$88)","v":0},0,0,0,0,0,0,0,0,{"$f":"SUM(P$86:P$88)","v":0},{"$f":"SUM(Q$86:Q$88)","v":0},{"$f":"SUM(R$86:R$88)","v":0},{"$f":"SUM(S$86:S$88)","v":0},0,0,0,0,0,0,0,0,0,0,0,0,0,0,0,0,0,0,0,0,0,0,0,0,0,0,0,0,0,0,0,0,0,0,0,0,0,0,0,0,0,0,0,0,0,0,0,0,0,0,0,0,0,0,0,0,0,0,0]
["Q3","Q3 2023-24","Nov","2023-24November","2023-24","November",null,null,null,null,null,null,null,null,null,null,null,null,null,null,null,null,null,null,null,null,null,null,null,null,0,0,0,0,0,0,0,0,0,0,0,0,0,0,0,0,0,0,0,0,0,0,0,0,0,0,0,0,0,0,0,0,0,0,0,0,0,0,0,0,0,0,0,0,0,0,0,0,0,0,0,0,0,0,0,0,0,0,0,0,0,0,0,0,0,0,0,0,0,0,0,0,0,0,0,0,0,0,0,0,0,0,0,0]
["Q3","Q3 2023-24","Dec","2023-24December","2023-24","December",null,null,null,null,null,null,null,null,null,null,null,null,null,null,null,null,null,null,null,null,null,null,null,null,0,0,0,0,0,0,0,0,0,0,0,0,0,0,0,0,0,0,0,0,0,0,0,0,0,0,0,0,0,0,0,0,0,0,0,0,0,0,0,0,0,0,0,0,0,0,0,0,0,0,0,0,0,0,0,0,0,0,0,0,0,0,0,0,0,0,0,0,0,0,0,0,0,0,0,0,0,0,0,0,0,0,0,0]
["Q4","Q4 2023-24","Jan","2023-24January","2023-24","January",null,null,null,null,null,null,null,null,null,null,null,null,null,null,null,null,null,null,null,null,null,null,null,null,0,0,0,0,0,0,0,0,0,{"$f":"P88","v":0},0,0,{"$f":"SUM(G$89:G$91)","v":0},0,0,0,0,0,0,0,0,{"$f":"SUM(P$89:P$91)","v":0},{"$f":"SUM(Q$89:Q$91)","v":0},{"$f":"SUM(R$89:R$91)","v":0},{"$f":"SUM(S$89:S$91)","v":0},0,0,0,0,0,0,0,0,0,0,0,0,0,0,0,0,0,0,0,0,0,0,0,0,0,0,0,0,0,0,0,0,0,0,0,0,0,0,0,0,0,0,0,0,0,0,0,0,0,0,0,0,0,0,0,0,0,0,0]
["Q4","Q4 2023-24","Feb","2023-24February","2023-24","February",null,null,null,null,null,null,null,null,null,null,null,null,null,null,null,null,null,null,null,null,null,null,null,null,0,0,0,0,0,0,0,0,0,0,0,0,0,0,0,0,0,0,0,0,0,0,0,0,0,0,0,0,0,0,0,0,0,0,0,0,0,0,0,0,0,0,0,0,0,0,0,0,0,0,0,0,0,0,0,0,0,0,0,0,0,0,0,0,0,0,0,0,0,0,0,0,0,0,0,0,0,0,0,0,0,0,0,0]
["Q4","Q4 2023-24","Mar","2023-24March","2023-24","March",null,null,null,null,null,null,null,null,null,null,null,null,null,null,null,null,null,null,null,null,null,null,null,null,0,0,0,0,0,0,0,0,0,0,0,0,0,0,0,0,0,0,0,0,0,0,0,0,0,0,0,0,0,0,0,0,0,0,0,0,0,0,0,0,0,0,0,0,0,{"$f":"AZ88","v":0},{"$f":"BA88","v":0},{"$f":"BB88","v":0},0,0,0,0,0,0,0,0,0,0,0,0,0,0,0,0,0,0,0,0,0,0,0,0,0,0,0,0,0,0,0,0,0,0,0,0]
["Q1","Q1 2024-25","Apr, 21-22",{"$f":"E92&F92","v":"2024-25April"},"2024-25","April",null,null,null,null,null,null,null,null,null,null,null,null,null,null,null,null,null,null,null,null,null,null,null,null,0,0,0,0,0,0,0,0,0,0,0,0,{"$f":"SUM(G$92:G$94)","v":0},0,0,0,0,0,0,0,0,{"$f":"SUM(P$92:P$94)","v":0},{"$f":"SUM(Q$92:Q$94)","v":0},{"$f":"SUM(R$92:R$94)","v":0},{"$f":"SUM(S$92:S$94)","v":0},0,0,0,0,0,0,0,0,0,0,0,0,0,0,0,0,0,0,0,0,0,0,0,{"$f":"SUM(G$92:G$103)","v":0},0,0,0,0,0,0,0,0,{"$f":"SUM(P$92:P$103)","v":0},{"$f":"SUM(Q$92:Q$103)","v":0},{"$f":"SUM(R$92:R$103)","v":0},{"$f":"SUM(S$92:S$103)","v":0},0,0,0,0,0,{"$f":"SUM(Y$92:Y$103)","v":0},{"$f":"SUM(Z$92:Z$103)","v":0},{"$f":"SUM(AA$92:AA$103)","v":0},{"$f":"SUM(AB$92:AB$103)","v":0},{"$f":"SUM(AC$92:AC$103)","v":0},{"$f":"SUM(AD$92:AD$103)","v":0},0,0,0,0,0,0,0,0,0,0,0,0]
["Q1","Q1 2024-25","May","2024-25May","2024-25","May",null,null,null,null,null,null,null,null,null,null,null,null,null,null,null,null,null,null,null,null,null,null,null,null,0,0,0,0,0,0,0,0,0,0,0,0,0,0,0,0,0,0,0,0,0,0,0,0,0,0,0,0,0,0,0,0,0,0,0,0,0,0,0,0,0,0,0,0,0,0,0,0,{"$f":"SUM(G$92:G$103)","v":0},{"$f":"SUM(H$92:H$103)","v":0},{"$f":"SUM(I$92:I$103)","v":0},{"$f":"SUM(J$92:J$103)","v":0},{"$f":"SUM(K$92:K$103)","v":0},{"$f":"SUM(L$92:L$103)","v":0},{"$f":"SUM(M$92:M$103)","v":0},{"$f":"SUM(N$92:N$103)","v":0},{"$f":"SUM(O$92:O$103)","v":0},0,0,0,0,0,0,0,0,0,{"$f":"SUM(Y$92:Y$103)","v":0},0,0,0,0,0,0,0,0,0,0,0,0,0,0,0,0,0]
["Q1","Q1 2024-25","Jun","2024-25June","2024-25","June",null,null,null,null,null,null,null,null,null,null,null,null,null,null,null,null,null,null,null,null,null,null,null,null,0,0,0,0,0,0,0,0,0,0,0,0,0,0,0,0,0,0,0,0,0,0,0,0,0,0,0,0,0,0,0,0,0,0,0,0,0,0,0,0,0,0,0,0,0,0,0,0,0,0,0,0,0,0,0,0,0,0,0,0,0,0,0,0,0,0,0,0,0,0,0,0,0,0,0,0,0,0,0,0,0,0,0,0]
["Q2","Q2 2024-25","Jul","2024-25July","2024-25","July",null,null,null,null,null,null,null,null,null,null,null,null,null,null,null,null,null,null,null,null,null,null,null,null,0,0,0,0,0,0,0,0,0,0,0,0,{"$f":"SUM(G$95:G$97)","v":0},0,0,0,0,0,0,0,0,{"$f":"SUM(P$95:P$97)","v":0},{"$f":"SUM(Q$95:Q$97)","v":0},{"$f":"SUM(R$95:R$97)","v":0},{"$f":"SUM(S$95:S$97)","v":0},0,0,0,0,0,0,0,0,0,0,0,0,0,0,0,0,0,0,0,0,0,0,0,0,0,0,0,0,0,0,0,0,0,0,0,0,0,0,0,0,0,0,0,0,0,0,0,0,0,0,0,0,0,0,0,0,0,0,0]
["Q2","Q2 2024-25","Aug","2024-25August","2024-25","August",null,null,null,null,null,null,null,null,null,null,null,null,null,null,null,null,null,null,null,null,null,null,null,null,0,0,0,0,0,0,0,0,0,0,0,0,{"$f":"SUM(G$95:G$97)","v":0},{"$f":"SUM(H$95:H$97)","v":0},0,0,0,0,0,0,0,0,0,0,0,0,0,0,0,0,0,0,0,0,0,0,0,0,0,0,0,0,0,0,0,0,0,0,0,0,0,0,0,0,0,0,0,0,0,0,0,0,0,0,0,0,0,0,0,0,0,0,0,0,0,0,0,0,0,0,0,0,0,0]
["Q2","Q2 2024-25","Sep","2024-25September","2024-25","September",null,null,null,null,null,null,null,null,null,null,null,null,null,null,null,null,null,null,null,null,null,null,null,null,0,0,0,0,0,0,0,0,0,0,0,0,0,0,0,0,0,0,0,0,0,0,0,0,0,0,0,0,0,0,0,0,0,0,0,0,0,0,0,0,0,0,0,0,0,0,0,0,0,0,0,0,0,0,0,0,0,0,0,0,0,0,0,0,0,0,0,0,0,0,0,0,0,0,0,0,0,0,0,0,0,0,0,0]
["Q3","Q3 2024-25","Oct","2024-25October","2024-25","October",null,null,null,null,null,null,null,null,null,null,null,null,null,null,null,null,null,null,null,null,null,null,null,null,0,0,0,0,0,0,0,0,0,0,0,0,{"$f":"SUM(G$98:G$100)","v":0},0,0,0,0,0,0,0,0,{"$f":"SUM(P$98:P$100)","v":0},{"$f":"SUM(Q$98:Q$100)","v":0},{"$f":"SUM(R$98:R$100)","v":0},{"$f":"SUM(S$98:S$100)","v":0},0,0,0,0,0,0,0,0,0,0,0,0,0,0,0,0,0,0,0,0,0,0,0,0,0,0,0,0,0,0,0,0,0,0,0,0,0,0,0,0,0,0,0,0,0,0,0,0,0,0,0,0,0,0,0,0,0,0,0]
["Q3","Q3 2024-25","Nov","2024-25November","2024-25","November",null,null,null,null,null,null,null,null,null,null,null,null,null,null,null,null,null,null,null,null,null,null,null,null,0,0,0,0,0,0,0,0,0,0,0,0,{"$f":"SUM(G$98:G$100)","v":0},{"$f":"SUM(H$98:H$100)","v":0},0,0,0,0,0,0,0,0,0,0,0,0,0,0,0,0,0,0,0,0,0,0,0,0,0,0,0,0,0,0,0,0,0,0,0,0,0,0,0,0,0,0,0,0,0,0,0,0,0,0,0,0,0,0,0,0,0,0,0,0,0,0,0,0,0,0,0,0,0,0]
["Q3","Q3 2024-25","Dec","2024-25December","2024-25","December",null,null,null,null,null,null,null,null,null,null,null,null,null,null,null,null,null,null,null,null,null,null,null,null,0,0,0,0,0,0,0,0,0,0,0,0,0,0,0,0,0,0,0,0,0,0,0,0,0,0,0,0,0,0,0,0,0,0,0,0,0,0,0,0,0,0,0,0,0,0,0,0,0,0,0,0,0,0,0,0,0,0,0,0,0,0,0,0,0,0,0,0,0,0,0,0,0,0,0,0,0,0,0,0,0,0,0,0]
["Q4","Q4 2024-25","Jan","2024-25January","2024-25","January",null,null,null,null,null,null,null,null,null,null,null,null,null,null,null,null,null,null,null,null,null,null,null,null,0,0,0,0,0,0,0,0,0,0,0,0,{"$f":"SUM(G$101:G$103)","v":0},0,0,0,0,0,0,0,0,{"$f":"SUM(P$101:P$103)","v":0},{"$f":"SUM(Q$101:Q$103)","v":0},{"$f":"SUM(R$101:R$103)","v":0},{"$f":"SUM(S$101:S$103)","v":0},0,0,0,0,0,0,0,0,0,0,0,0,0,0,0,0,0,0,0,0,0,0,0,0,0,0,0,0,0,0,0,0,0,0,0,0,0,0,0,0,0,0,0,0,0,0,0,0,0,0,0,0,0,0,0,0,0,0,0]
["Q4","Q4 2024-25","Feb","2024-25February","2024-25","February",null,null,null,null,null,null,null,null,null,null,null,null,null,null,null,null,null,null,null,null,null,null,null,null,0,0,0,0,0,0,0,0,0,0,0,0,{"$f":"SUM(G$101:G$103)","v":0},{"$f":"SUM(H$101:H$103)","v":0},0,0,0,0,0,0,0,0,0,0,0,0,0,0,0,0,0,0,0,0,0,0,0,0,0,0,0,0,0,0,0,0,0,0,0,0,0,0,0,0,0,0,0,0,0,0,0,0,0,0,0,0,0,0,0,0,0,0,0,0,0,0,0,0,0,0,0,0,0,0]
["Q4","Q4 2024-25","Mar","2024-25March","2024-25","March",null,null,null,null,null,null,null,null,null,null,null,null,null,null,null,null,null,null,null,null,null,null,null,null,0,0,0,0,0,0,0,0,0,0,0,0,0,0,0,0,0,0,0,0,0,0,0,0,0,0,0,0,0,0,0,0,0,0,0,0,0,0,0,0,0,0,0,0,0,0,0,0,0,0,0,0,0,0,0,0,0,0,0,0,0,0,0,0,0,0,0,0,0,0,0,0,0,0,0,0,0,0,0,0,0,0,0,0]
["Q1","Q1 2025-26","Apr, 21-22","2025-26April","2025-26","April",null,null,null,null,null,null,null,null,null,null,null,null,null,null,null,null,null,null,null,null,null,null,null,null,0,0,0,0,0,0,0,0,0,0,0,0,{"$f":"SUM(G$104:G$106)","v":0},0,0,0,0,0,0,0,0,{"$f":"SUM(P$104:P$106)","v":0},{"$f":"SUM(Q$104:Q$106)","v":0},{"$f":"SUM(R$104:R$106)","v":0},{"$f":"SUM(S$104:S$106)","v":0},0,0,0,0,0,0,0,0,0,0,0,0,0,0,0,0,0,0,0,0,0,0,0,{"$f":"SUM(G$104:G$115)","v":0},0,0,0,0,0,0,0,0,{"$f":"SUM(P$104:P$115)","v":0},{"$f":"SUM(Q$104:Q$115)","v":0},{"$f":"SUM(R$104:R$115)","v":0},{"$f":"SUM(S$104:S$115)","v":0},0,0,0,0,0,{"$f":"SUM(Y$104:Y$115)","v":0},{"$f":"SUM(Z$104:Z$115)","v":0},{"$f":"SUM(AA$104:AA$115)","v":0},{"$f":"SUM(AB$104:AB$115)","v":0},{"$f":"SUM(AC$104:AC$115)","v":0},{"$f":"SUM(AD$104:AD$115)","v":0},0,0,0,0,0,0,0,0,0,0,0,0]
["Q1","Q1 2025-26","May","2025-26May","2025-26","May",null,null,null,null,null,null,null,null,null,null,null,null,null,null,null,null,null,null,null,null,null,null,null,null,0,0,0,0,0,0,0,0,{"$f":"O104","v":0},{"$f":"P104","v":0},0,0,{"$f":"SUM(G$104:G$106)","v":0},{"$f":"SUM(H$104:H$106)","v":0},0,0,0,0,0,0,0,0,0,0,0,0,0,0,0,0,0,0,0,0,0,0,0,0,0,0,0,0,0,0,0,0,0,0,{"$f":"SUM(G$104:G$115)","v":0},{"$f":"SUM(H$104:H$115)","v":0},{"$f":"SUM(I$104:I$115)","v":0},{"$f":"SUM(J$104:J$115)","v":0},{"$f":"SUM(K$104:K$115)","v":0},{"$f":"SUM(L$104:L$115)","v":0},{"$f":"SUM(M$104:M$115)","v":0},{"$f":"SUM(N$104:N$115)","v":0},{"$f":"SUM(O$104:O$115)","v":0},0,0,0,0,0,0,0,0,0,{"$f":"SUM(Y$104:Y$115)","v":0},0,0,0,0,0,0,0,0,0,0,0,0,0,0,0,0,0]
["Q1","Q1 2025-26","Jun","2025-26June","2025-26","June",null,null,null,null,null,null,null,null,null,null,null,null,null,null,null,null,null,null,null,null,null,null,null,null,0,0,0,0,0,0,0,0,0,0,0,0,0,0,0,0,0,0,0,0,0,0,0,0,0,0,0,0,0,0,0,0,0,0,0,0,0,0,0,0,0,0,0,0,0,0,0,0,0,0,0,0,0,0,0,0,0,0,0,0,0,0,0,0,0,0,0,0,0,0,0,0,0,0,0,0,0,0,0,0,0,0,0,0]
["Q2","Q2 2025-26","Jul","2025-26July","2025-26","July",null,null,null,null,null,null,null,null,null,null,null,null,null,null,null,null,null,null,null,null,null,null,null,null,0,0,0,0,0,0,0,0,0,0,0,0,{"$f":"SUM(G$107:G$109)","v":0},0,0,0,0,0,0,0,0,{"$f":"SUM(P$107:P$109)","v":0},{"$f":"SUM(Q$107:Q$109)","v":0},{"$f":"SUM(R$107:R$109)","v":0},{"$f":"SUM(S$107:S$109)","v":0},0,0,0,0,0,0,0,0,0,0,0,0,0,0,0,0,0,0,0,0,0,0,0,0,0,0,0,0,0,0,0,0,0,0,0,0,0,0,0,0,0,0,0,0,0,0,0,0,0,0,0,0,0,0,0,0,0,0,0]
["Q2","Q2 2025-26","Aug","2025-26August","2025-26","August",null,null,null,null,null,null,null,null,null,null,null,null,null,null,null,null,null,null,null,null,null,null,null,null,0,0,0,0,0,0,0,0,0,0,0,0,0,0,0,0,0,0,0,0,0,0,0,0,0,0,0,0,0,0,0,0,0,0,0,0,0,0,0,0,0,0,0,0,0,0,0,0,0,0,0,0,0,0,0,0,0,0,0,0,0,0,0,0,0,0,0,0,0,0,0,0,0,0,0,0,0,0,0,0,0,0,0,0]
["Q2","Q2 2025-26","Sep","2025-26September","2025-26","September",null,null,null,null,null,null,null,null,null,null,null,null,null,null,null,null,null,null,null,null,null,null,null,null,0,0,0,0,0,0,0,0,0,0,0,0,0,0,0,0,0,0,0,0,0,0,0,0,0,0,0,0,0,0,0,0,0,0,0,0,0,0,0,0,0,0,0,0,0,0,0,0,0,0,0,0,0,0,0,0,0,0,0,0,0,0,0,0,0,0,0,0,0,0,0,0,0,0,0,0,0,0,0,0,0,0,0,0]
["Q3","Q3 2025-26","Oct","2025-26October","2025-26","October",null,null,null,null,null,null,null,null,null,null,null,null,null,null,null,null,null,null,null,null,null,null,null,null,0,0,0,0,0,0,0,0,0,0,0,0,{"$f":"SUM(G$110:G$112)","v":0},{"$f":"SUM(H$110:H$112)","v":0},{"$f":"SUM(I$110:I$112)","v":0},{"$f":"SUM(J$110:J$112)","v":0},{"$f":"SUM(K$110:K$112)","v":0},{"$f":"SUM(L$110:L$112)","v":0},{"$f":"SUM(M$110:M$112)","v":0},{"$f":"SUM(N$110:N$112)","v":0},{"$f":"SUM(O$110:O$112)","v":0},{"$f":"SUM(P$110:P$112)","v":0},{"$f":"SUM(Q$110:Q$112)","v":0},{"$f":"SUM(R$110:R$112)","v":0},{"$f":"SUM(S$110:S$112)","v":0},{"$f":"SUM(T$110:T$112)","v":0},{"$f":"SUM(U$110:U$112)","v":0},{"$f":"SUM(V$110:V$112)","v":0},{"$f":"SUM(W$110:W$112)","v":0},{"$f":"SUM(X$110:X$112)","v":0},{"$f":"SUM(Y$110:Y$112)","v":0},{"$f":"SUM(Z$110:Z$112)","v":0},{"$f":"SUM(AA$110:AA$112)","v":0},{"$f":"SUM(AB$110:AB$112)","v":0},{"$f":"SUM(AC$110:AC$112)","v":0},{"$f":"SUM(AD$110:AD$112)","v":0},0,0,0,0,0,0,0,0,0,0,0,0,0,0,0,0,0,0,0,0,0,0,0,0,0,0,0,0,0,0,0,0,0,0,0,0,0,0,0,0,0,0,0,0,0,0,0,0]
["Q3","Q3 2025-26","Nov","2025-26November","2025-26","November",null,null,null,null,null,null,null,null,null,null,null,null,null,null,null,null,null,null,null,null,null,null,null,null,0,0,0,0,0,0,0,0,0,0,0,0,0,0,0,0,0,0,0,0,0,0,0,0,0,0,0,0,0,0,0,0,0,0,0,0,0,0,0,0,0,0,0,0,0,0,0,0,0,0,0,0,0,0,0,0,0,0,0,0,0,0,0,0,0,0,0,0,0,0,0,0,0,0,0,0,0,0,0,0,0,0,0,0]
["Q3","Q3 2025-26","Dec","2025-26December","2025-26","December",null,null,null,null,null,null,null,null,null,null,null,null,null,null,null,null,null,null,null,null,null,null,null,null,0,0,0,0,0,0,0,0,0,0,0,0,0,0,0,0,0,0,0,0,0,0,0,0,0,0,0,0,0,0,0,0,0,0,0,0,0,0,0,0,0,0,0,0,0,0,0,0,0,0,0,0,0,0,0,0,0,0,0,0,0,0,0,0,0,0,0,0,0,0,0,0,0,0,0,0,0,0,0,0,0,0,0,0]
["Q4","Q4 2025-26","Jan","2025-26January","2025-26","January",null,null,null,null,null,null,null,null,null,null,null,null,null,null,null,null,null,null,null,null,null,null,null,null,0,0,0,0,0,0,0,0,0,0,0,0,{"$f":"SUM(G$113:G$115)","v":0},0,0,0,0,0,0,0,0,{"$f":"SUM(P$113:P$115)","v":0},{"$f":"SUM(Q$113:Q$115)","v":0},{"$f":"SUM(R$113:R$115)","v":0},{"$f":"SUM(S$113:S$115)","v":0},0,0,0,0,0,0,0,0,0,0,0,0,0,0,0,0,0,0,0,0,0,0,0,0,0,0,0,0,0,0,0,0,0,0,0,0,0,0,0,0,0,0,0,0,0,0,0,0,0,0,0,0,0,0,0,0,0,0,0]
["Q4","Q4 2025-26","Feb","2025-26February","2025-26","February",null,null,null,null,null,null,null,null,null,null,null,null,null,null,null,null,null,null,null,null,null,null,null,null,0,0,0,0,0,0,0,0,0,0,0,0,{"$f":"SUM(G$113:G$115)","v":0},{"$f":"SUM(H$113:H$115)","v":0},0,0,0,0,0,0,0,0,0,0,0,0,0,0,0,0,0,0,0,0,0,0,0,0,0,0,0,0,0,0,0,0,0,0,0,0,0,0,0,0,0,0,0,0,0,0,0,0,0,0,0,0,0,0,0,0,0,0,0,0,0,0,0,0,0,0,0,0,0,0]
["Q4","Q4 2025-26","Mar","2025-26March","2025-26","March",null,null,null,null,null,null,null,null,null,null,null,null,null,null,null,null,null,null,null,null,null,null,null,null,0,0,0,0,0,0,0,0,0,0,0,0,0,0,0,0,0,0,0,0,0,0,0,0,0,0,0,0,0,0,0,0,0,0,0,0,0,0,0,0,0,0,0,0,0,0,0,0,0,0,0,0,0,0,0,0,0,0,0,0,0,0,0,0,0,0,0,0,0,0,0,0,0,0,0,0,0,0,0,0,0,0,0,0]
["Q1","Q1 2026-27","Apr, 21-22","2026-27April","2026-27","April",null,null,null,null,null,null,null,null,null,null,null,null,null,null,null,null,null,null,null,null,null,null,null,null,0,0,0,0,0,0,0,0,0,0,0,0,{"$f":"SUM(G$116:G$118)","v":0},0,0,0,0,0,0,0,0,{"$f":"SUM(P$116:P$118)","v":0},{"$f":"SUM(Q$116:Q$118)","v":0},{"$f":"SUM(R$116:R$118)","v":0},{"$f":"SUM(S$116:S$118)","v":0},0,0,0,0,0,0,0,0,0,0,0,0,0,0,0,0,0,0,0,0,0,0,0,{"$f":"SUM(G$116:G$127)","v":0},0,0,0,0,0,0,0,0,{"$f":"SUM(P$116:P$127)","v":0},{"$f":"SUM(Q$116:Q$127)","v":0},{"$f":"SUM(R$116:R$127)","v":0},{"$f":"SUM(S$116:S$127)","v":0},0,0,0,0,0,{"$f":"SUM(Y$116:Y$127)","v":0},{"$f":"SUM(Z$116:Z$127)","v":0},{"$f":"SUM(AA$116:AA$127)","v":0},{"$f":"SUM(AB$116:AB$127)","v":0},{"$f":"SUM(AC$116:AC$127)","v":0},{"$f":"SUM(AD$116:AD$127)","v":0},0,0,0,0,0,0,0,0,0,0,0,0]
["Q1","Q1 2026-27","May","2026-27May","2026-27","May",null,null,null,null,null,null,null,null,null,null,null,null,null,null,null,null,null,null,null,null,null,null,null,null,0,0,0,0,0,0,0,0,0,0,0,0,{"$f":"SUM(G$116:G$118)","v":0},{"$f":"SUM(H$116:H$118)","v":0},0,0,0,0,0,0,0,0,0,0,0,0,0,0,0,0,0,0,0,0,0,0,0,0,0,0,0,0,0,0,0,0,0,0,{"$f":"SUM(G$116:G$127)","v":0},{"$f":"SUM(H$116:H$127)","v":0},{"$f":"SUM(I$116:I$127)","v":0},{"$f":"SUM(J$116:J$127)","v":0},{"$f":"SUM(K$116:K$127)","v":0},{"$f":"SUM(L$116:L$127)","v":0},{"$f":"SUM(M$116:M$127)","v":0},{"$f":"SUM(N$116:N$127)","v":0},{"$f":"SUM(O$116:O$127)","v":0},0,0,0,0,0,0,0,0,0,{"$f":"SUM(Y$116:Y$127)","v":0},0,0,0,0,0,0,0,0,0,0,0,0,0,0,0,0,0]
["Q1","Q1 2026-27","Jun","2026-27June","2026-27","June",null,null,null,null,null,null,null,null,null,null,null,null,null,null,null,null,null,null,null,null,null,null,null,null,0,0,0,0,0,0,0,0,0,0,0,0,0,0,0,0,0,0,0,0,0,0,0,0,0,0,0,0,0,0,0,0,0,0,0,0,0,0,0,0,0,0,0,0,0,0,0,0,0,0,0,0,0,0,0,0,0,0,0,0,0,0,0,0,0,0,0,0,0,0,0,0,0,0,0,0,0,0,0,0,0,0,0,0]
["Q2","Q2 2026-27","Jul","2026-27July","2026-27","July",null,null,null,null,null,null,null,null,null,null,null,null,null,null,null,null,null,null,null,null,null,null,null,null,0,0,0,0,0,0,0,0,0,0,0,0,{"$f":"SUM(G$119:G$121)","v":0},{"$f":"SUM(H$119:H$121)","v":0},{"$f":"SUM(I$119:I$121)","v":0},{"$f":"SUM(J$119:J$121)","v":0},{"$f":"SUM(K$119:K$121)","v":0},{"$f":"SUM(L$119:L$121)","v":0},{"$f":"SUM(M$119:M$121)","v":0},{"$f":"SUM(N$119:N$121)","v":0},{"$f":"SUM(O$119:O$121)","v":0},{"$f":"SUM(P$119:P$121)","v":0},{"$f":"SUM(Q$119:Q$121)","v":0},{"$f":"SUM(R$119:R$121)","v":0},{"$f":"SUM(S$119:S$121)","v":0},{"$f":"SUM(T$119:T$121)","v":0},{"$f":"SUM(U$119:U$121)","v":0},{"$f":"SUM(V$119:V$121)","v":0},{"$f":"SUM(W$119:W$121)","v":0},{"$f":"SUM(X$119:X$121)","v":0},{"$f":"SUM(Y$119:Y$121)","v":0},{"$f":"SUM(Z$119:Z$121)","v":0},{"$f":"SUM(AA$119:AA$121)","v":0},{"$f":"SUM(AB$119:AB$121)","v":0},{"$f":"SUM(AC$119:AC$121)","v":0},{"$f":"SUM(AD$119:AD$121)","v":0},0,0,0,0,0,0,0,0,0,0,0,0,0,0,0,0,0,0,0,0,0,0,0,0,0,0,0,0,0,0,0,0,0,0,0,0,0,0,0,0,0,0,0,0,0,0,0,0]
["Q2","Q2 2026-27","Aug","2026-27August","2026-27","August",null,null,null,null,null,null,null,null,null,null,null,null,null,null,null,null,null,null,null,null,null,null,null,null,0,0,0,0,0,0,0,0,0,0,0,0,0,0,0,0,0,0,0,0,0,0,0,0,0,0,0,0,0,0,0,0,0,0,0,0,0,0,0,0,0,0,0,0,0,0,0,0,0,0,0,0,0,0,0,0,0,0,0,0,0,0,0,0,0,0,0,0,0,0,0,0,0,0,0,0,0,0,0,0,0,0,0,0]
["Q2","Q2 2026-27","Sep","2026-27September","2026-27","September",null,null,null,null,null,null,null,null,null,null,null,null,null,null,null,null,null,null,null,null,null,null,null,null,0,0,0,0,0,0,0,0,0,{"$f":"P120","v":0},0,0,0,0,0,0,0,0,0,0,0,0,0,0,0,0,0,0,0,0,0,0,0,0,0,0,0,0,0,0,0,0,0,0,0,0,0,0,0,0,0,0,0,0,0,0,0,0,0,0,0,0,0,0,0,0,0,0,0,0,0,0,0,0,0,0,0,0,0,0,0,0,0,0]
["Q3","Q3 2026-27","Oct","2026-27October","2026-27","October",null,null,null,null,null,null,null,null,null,null,null,null,null,null,null,null,null,null,null,null,null,null,null,null,0,0,0,0,0,0,0,0,0,0,0,0,{"$f":"SUM(G$122:G$124)","v":0},0,0,0,0,0,0,0,0,{"$f":"SUM(P$122:P$124)","v":0},{"$f":"SUM(Q$122:Q$124)","v":0},{"$f":"SUM(R$122:R$124)","v":0},{"$f":"SUM(S$122:S$124)","v":0},0,0,0,0,0,0,0,0,0,0,0,0,0,0,0,0,0,0,0,0,0,0,0,0,0,0,0,0,0,0,0,0,0,0,0,0,0,0,0,0,0,0,0,0,0,0,0,0,0,0,0,0,0,0,0,0,0,0,0]
["Q3","Q3 2026-27","Nov","2026-27November","2026-27","November",null,null,null,null,null,null,null,null,null,null,null,null,null,null,null,null,null,null,null,null,null,null,null,null,0,0,0,0,0,0,0,0,0,0,0,0,{"$f":"SUM(G$122:G$124)","v":0},{"$f":"SUM(H$122:H$124)","v":0},0,0,0,0,0,0,0,0,0,0,0,0,0,0,0,0,0,0,0,0,0,0,0,0,0,0,0,0,0,0,0,0,0,0,0,0,0,0,0,0,0,0,0,0,0,0,0,0,0,0,0,0,0,0,0,0,0,0,0,0,0,0,0,0,0,0,0,0,0,0]
["Q3","Q3 2026-27","Dec","2026-27December","2026-27","December",null,null,null,null,null,null,null,null,null,null,null,null,null,null,null,null,null,null,null,null,null,null,null,null,0,0,0,0,0,0,0,0,0,0,0,0,{"$f":"SUM(G$122:G$124)","v":0},0,0,0,0,0,0,0,0,0,0,0,0,0,0,0,0,0,0,0,0,0,0,0,0,0,0,0,0,0,0,0,0,0,0,0,0,0,0,0,0,0,0,0,0,0,0,0,0,0,0,0,0,0,0,0,0,0,0,0,0,0,0,0,0,0,0,0,0,0,0,0]
["Q4","Q4 2026-27","Jan","2026-27January","2026-27","January",null,null,null,null,null,null,null,null,null,null,null,null,null,null,null,null,null,null,null,null,null,null,null,null,0,0,0,0,0,0,0,0,0,0,0,0,{"$f":"SUM(G$125:G$127)","v":0},0,0,0,0,0,0,0,0,{"$f":"SUM(P$125:P$127)","v":0},{"$f":"SUM(Q$125:Q$127)","v":0},{"$f":"SUM(R$125:R$127)","v":0},{"$f":"SUM(S$125:S$127)","v":0},0,0,0,0,0,0,0,0,0,0,0,0,0,0,0,0,0,0,0,0,0,0,0,0,0,0,0,0,0,0,0,0,0,0,0,0,0,0,0,0,0,0,0,0,0,0,0,0,0,0,0,0,0,0,0,0,0,0,0]
["Q4","Q4 2026-27","Feb","2026-27February","2026-27","February",null,null,null,null,null,null,null,null,null,null,null,null,null,null,null,null,null,null,null,null,null,null,null,null,0,0,0,0,0,0,0,0,0,0,0,0,{"$f":"SUM(G$125:G$127)","v":0},{"$f":"SUM(H$125:H$127)","v":0},0,0,0,0,0,0,0,0,0,0,0,0,0,0,0,0,0,0,0,0,0,0,0,0,0,0,0,0,0,0,0,0,0,0,0,0,0,0,0,0,0,0,0,0,0,0,0,0,0,0,0,0,0,0,0,0,0,0,0,0,0,0,0,0,0,0,0,0,0,0]
["Q4","Q4 2026-27","Mar","2026-27March","2026-27","March",null,null,null,null,null,null,null,null,null,null,null,null,null,null,null,null,null,null,null,null,null,null,null,null,0,0,0,0,0,0,0,0,0,0,0,0,0,0,0,0,0,0,0,0,0,0,0,0,0,0,0,0,0,0,0,0,0,0,0,0,0,0,0,0,0,0,0,0,0,0,0,0,0,0,0,0,0,0,0,0,0,0,0,0,0,0,0,0,0,0,0,0,0,0,0,0,0,0,0,0,0,0,0,0,0,0,0,0]