{"text_format":"1","workbook":"xlsx","n_sheets":6,"sheets":["Notes","Summary","Region (Local Office)","Trusts","Categories","BS"],"not_rendered":{"charts":0,"images":0,"macros":1,"external_links":1,"defined_names":14,"comments":0,"pivot_tables":0},"unopened":[],"bounds":{"document_bytes":16777216,"sheet_cells":100000,"rows_first":2000,"rows_last":500,"rows_between":2000,"halvings":0,"cell_chars":16384,"cell_head_chars":4096},"cells_cut":0,"cells_raw":0,"read":"whole","date_system":"1900"}

{"sheet":"Notes","index":0,"n_rows":2,"n_cols":8,"rows_kept":2,"cut":false,"hidden":false,"merged":[[1,1,1,4]]}
[]
[null,"Mental Health Friends and Family Test (FFT) data - December 2018",null,null,null,null,null,"  Show data for:"]

{"sheet":"Summary","index":1,"n_rows":12,"n_cols":10,"rows_kept":12,"cut":false,"hidden":false,"merged":[[2,1,3,1],[2,4,2,5],[2,6,2,7],[2,8,2,9]]}
[]
[]
[null,"FFT","Number of organisations submitting","Total responses to date","Responses",null,"Score (% recommend)",null,"Score (% not recommend)"]
[null,null,"2018-12-01","2018-12-01","2018-12-01","2018-11-26","2018-12-01","2018-11-26","2018-12-01","2018-11-26"]
[null,"Mental Health Overall",75,887000,17577,22587,0.88974227683905105,0.89489529375304377,4.1019514137793707E-2,3.5772789657767742E-2]
[null,"Primary Care",43,152239,3230,4573,0.94767801857585143,0.94576864202930244,1.7956656346749224E-2,1.9462059916903564E-2]
[null,"Secondary Care Community Services",57,329253,6565,8142,0.89550647372429548,0.90149840334070253,3.7014470677837016E-2,3.1196266273642841E-2]
[null,"Acute Services",53,144031,2629,3361,0.82959300114111834,0.82832490330258857,7.7976416888550781E-2,7.1407319250223145E-2]
[null,"Specialist Services",43,69359,1393,1989,0.88729361091170134,0.9120160884866767,4.6661880832735106E-2,2.6646556058320763E-2]
[null,"Secure and Forensic Services",17,33120,810,739,0.80864197530864201,0.8092016238159675,7.5308641975308649E-2,7.0365358592692828E-2]
[null,"Child and Adolescent Mental Health Services",47,104317,2165,2598,0.88175519630484989,0.87451886066204776,3.2794457274826792E-2,3.2717474980754425E-2]
[null,"Mental Health Other",32,54681,785,1185,0.91464968152866244,0.91139240506329111,2.2929936305732482E-2,2.9535864978902954E-2]

{"sheet":"Region (Local Office)","index":2,"n_rows":22,"n_cols":32,"rows_kept":22,"cut":false,"hidden":false,"merged":[[2,22,3,22],[2,23,3,23],[2,24,3,24],[2,25,3,25],[2,26,2,31],[2,12,3,12],[2,13,3,13],[2,14,3,14],[2,15,3,15],[2,16,2,21],[2,6,2,11],[2,0,3,0],[2,1,3,1],[2,2,3,2],[2,3,3,3],[2,4,3,4],[2,5,3,5]]}
[]
[]
["Region (LO) Code","Region (Local Office)","Total Responses","Total Eligible","Percentage Recommended","Percentage Not  Recommended","Breakdown of Responses",null,null,null,null,null,"Total Responses","Total Eligible","Percentage Recommended","Percentage Not  Recommended","Breakdown of Responses",null,null,null,null,null,"Total Responses","Total Eligible","Percentage Recommended","Percentage Not  Recommended","Breakdown of Responses"]
[null,null,null,null,null,null,"Extremely Likely","Likely","Neither","Unlikely","Extremely Unlikely","Don't Know",null,null,null,null,"Extremely Likely","Likely","Neither","Unlikely","Extremely Unlikely","Don't Know",null,null,null,null,"Extremely Likely","Likely","Neither","Unlikely","Extremely Unlikely","Don't Know"]
[null,"England (including Independent Sector Providers)",17577,659941,0.88974227683905105,4.1019514137793707E-2,10919,4720,773,326,395,444,{"$f":"SUM(M8:M22)","v":17577},{"$f":"SUM(N8:N22)","v":659941},{"$f":"SUM(Q5:R5)/M5","v":0.88974227683905105},{"$f":"SUM(T5:U5)/M5","v":4.1019514137793707E-2},10919,4720,773,326,395,444]
[null,"England (excluding Independent Sector Providers)",16842,646751,0.88843367771048565,4.1384633653960334E-2,10417,4546,745,312,385,437,{"$f":"SUM(M8:M21)","v":16842},{"$f":"SUM(N8:N21)","v":646751},0.88843367771048565,4.1384633653960334E-2,10417,4546,745,312,385,437]
[null,"Selection (excluding suppressed data)",{"$f":"SUBTOTAL(9,C8:C34)","v":17577},{"$f":"SUBTOTAL(9,D8:D34)","v":659941},{"$f":"IFERROR((G7+H7)/SUM(G7:L7), \"-\")","v":0.88974227683905105},{"$f":"IFERROR((J7+K7)/SUM(G7:L7), \"-\")","v":4.1019514137793707E-2},{"$f":"SUBTOTAL(9,G8:G34)","v":10919},4720,773,326,395,444,{"$f":"SUMIF(M8:M22,\"<>*\",C8:C22)","v":17577},{"$f":"SUMIF(N8:N22,\"<>*\",D8:D22)","v":659941},0.88974227683905105,4.1019514137793707E-2,10919,4720,773,326,395,444]
["Q72","NHS England Yorkshire & Humber",925,58494,0.90486486486486484,4.9729729729729728E-2,677,160,22,14,32,20,{"$f":"VLOOKUP($A8,[1]Sheet1!$A$29:$I$44,8,FALSE)","v":925},{"$f":"VLOOKUP($A8,[1]Sheet1!$A$29:$I$44,9,FALSE)","v":58494},{"$f":"SUM(Q8:R8)/M8","v":0.90486486486486484},{"$f":"SUM(T8:U8)/M8","v":4.9729729729729728E-2},{"$f":"VLOOKUP($A8,[1]Sheet1!$A$29:$I$44,2,FALSE)","v":677},{"$f":"VLOOKUP($A8,[1]Sheet1!$A$29:$I$44,3,FALSE)","v":160},{"$f":"VLOOKUP($A8,[1]Sheet1!$A$29:$I$44,4,FALSE)","v":22},{"$f":"VLOOKUP($A8,[1]Sheet1!$A$29:$I$44,5,FALSE)","v":14},{"$f":"VLOOKUP($A8,[1]Sheet1!$A$29:$I$44,6,FALSE)","v":32},{"$f":"VLOOKUP($A8,[1]Sheet1!$A$29:$I$44,7,FALSE)","v":20}]
["Q74","NHS England Cumbria & North East",2486,107769,0.87530168946098152,5.108608205953339E-2,1418,758,122,58,69,61,{"$f":"VLOOKUP($A9,[1]Sheet1!$A$29:$I$44,8,FALSE)","v":2486},{"$f":"VLOOKUP($A9,[1]Sheet1!$A$29:$I$44,9,FALSE)","v":107769},{"$f":"SUM(Q9:R9)/M9","v":0.87530168946098152},{"$f":"SUM(T9:U9)/M9","v":5.108608205953339E-2},{"$f":"VLOOKUP($A9,[1]Sheet1!$A$29:$I$44,2,FALSE)","v":1418},{"$f":"VLOOKUP($A9,[1]Sheet1!$A$29:$I$44,3,FALSE)","v":758},{"$f":"VLOOKUP($A9,[1]Sheet1!$A$29:$I$44,4,FALSE)","v":122},{"$f":"VLOOKUP($A9,[1]Sheet1!$A$29:$I$44,5,FALSE)","v":58},{"$f":"VLOOKUP($A9,[1]Sheet1!$A$29:$I$44,6,FALSE)","v":69},{"$f":"VLOOKUP($A9,[1]Sheet1!$A$29:$I$44,7,FALSE)","v":61}]
["Q75","NHS England Cheshire & Merseyside",717,32249,0.9191073919107392,1.9525801952580194E-2,403,256,35,7,7,9,{"$f":"VLOOKUP($A10,[1]Sheet1!$A$29:$I$44,8,FALSE)","v":717},{"$f":"VLOOKUP($A10,[1]Sheet1!$A$29:$I$44,9,FALSE)","v":32249},0.9191073919107392,1.9525801952580194E-2,{"$f":"VLOOKUP($A10,[1]Sheet1!$A$29:$I$44,2,FALSE)","v":403},{"$f":"VLOOKUP($A10,[1]Sheet1!$A$29:$I$44,3,FALSE)","v":256},{"$f":"VLOOKUP($A10,[1]Sheet1!$A$29:$I$44,4,FALSE)","v":35},{"$f":"VLOOKUP($A10,[1]Sheet1!$A$29:$I$44,5,FALSE)","v":7},{"$f":"VLOOKUP($A10,[1]Sheet1!$A$29:$I$44,6,FALSE)","v":7},{"$f":"VLOOKUP($A10,[1]Sheet1!$A$29:$I$44,7,FALSE)","v":9}]
["Q83","NHS England Greater Manchester",479,20938,0.81419624217119002,0.10855949895615867,314,76,21,35,17,16,{"$f":"VLOOKUP($A11,[1]Sheet1!$A$29:$I$44,8,FALSE)","v":479},{"$f":"VLOOKUP($A11,[1]Sheet1!$A$29:$I$44,9,FALSE)","v":20938},0.81419624217119002,0.10855949895615867,{"$f":"VLOOKUP($A11,[1]Sheet1!$A$29:$I$44,2,FALSE)","v":314},{"$f":"VLOOKUP($A11,[1]Sheet1!$A$29:$I$44,3,FALSE)","v":76},{"$f":"VLOOKUP($A11,[1]Sheet1!$A$29:$I$44,4,FALSE)","v":21},{"$f":"VLOOKUP($A11,[1]Sheet1!$A$29:$I$44,5,FALSE)","v":35},{"$f":"VLOOKUP($A11,[1]Sheet1!$A$29:$I$44,6,FALSE)","v":17},{"$f":"VLOOKUP($A11,[1]Sheet1!$A$29:$I$44,7,FALSE)","v":16}]
["Q84","NHS England Lancashire",293,26973,0.92150170648464169,3.4129692832764506E-2,188,82,10,5,5,3,{"$f":"VLOOKUP($A12,[1]Sheet1!$A$29:$I$44,8,FALSE)","v":293},{"$f":"VLOOKUP($A12,[1]Sheet1!$A$29:$I$44,9,FALSE)","v":26973},0.92150170648464169,3.4129692832764506E-2,{"$f":"VLOOKUP($A12,[1]Sheet1!$A$29:$I$44,2,FALSE)","v":188},{"$f":"VLOOKUP($A12,[1]Sheet1!$A$29:$I$44,3,FALSE)","v":82},{"$f":"VLOOKUP($A12,[1]Sheet1!$A$29:$I$44,4,FALSE)","v":10},{"$f":"VLOOKUP($A12,[1]Sheet1!$A$29:$I$44,5,FALSE)","v":5},{"$f":"VLOOKUP($A12,[1]Sheet1!$A$29:$I$44,6,FALSE)","v":5},{"$f":"VLOOKUP($A12,[1]Sheet1!$A$29:$I$44,7,FALSE)","v":3}]
["Q76","NHS England North Midlands",797,41894,0.89460476787954835,3.6386449184441658E-2,523,190,31,12,17,24,{"$f":"VLOOKUP($A13,[1]Sheet1!$A$29:$I$44,8,FALSE)","v":797},{"$f":"VLOOKUP($A13,[1]Sheet1!$A$29:$I$44,9,FALSE)","v":41894},0.89460476787954835,3.6386449184441658E-2,{"$f":"VLOOKUP($A13,[1]Sheet1!$A$29:$I$44,2,FALSE)","v":523},{"$f":"VLOOKUP($A13,[1]Sheet1!$A$29:$I$44,3,FALSE)","v":190},{"$f":"VLOOKUP($A13,[1]Sheet1!$A$29:$I$44,4,FALSE)","v":31},{"$f":"VLOOKUP($A13,[1]Sheet1!$A$29:$I$44,5,FALSE)","v":12},{"$f":"VLOOKUP($A13,[1]Sheet1!$A$29:$I$44,6,FALSE)","v":17},{"$f":"VLOOKUP($A13,[1]Sheet1!$A$29:$I$44,7,FALSE)","v":24}]
["Q77","NHS England West Midlands",869,45352,0.88607594936708856,2.5316455696202531E-2,519,251,38,11,11,39,{"$f":"VLOOKUP($A14,[1]Sheet1!$A$29:$I$44,8,FALSE)","v":869},{"$f":"VLOOKUP($A14,[1]Sheet1!$A$29:$I$44,9,FALSE)","v":45352},0.88607594936708856,2.5316455696202531E-2,{"$f":"VLOOKUP($A14,[1]Sheet1!$A$29:$I$44,2,FALSE)","v":519},{"$f":"VLOOKUP($A14,[1]Sheet1!$A$29:$I$44,3,FALSE)","v":251},{"$f":"VLOOKUP($A14,[1]Sheet1!$A$29:$I$44,4,FALSE)","v":38},{"$f":"VLOOKUP($A14,[1]Sheet1!$A$29:$I$44,5,FALSE)","v":11},{"$f":"VLOOKUP($A14,[1]Sheet1!$A$29:$I$44,6,FALSE)","v":11},{"$f":"VLOOKUP($A14,[1]Sheet1!$A$29:$I$44,7,FALSE)","v":39}]
["Q78","NHS England Central Midlands",1614,50850,0.91201982651796776,2.3543990086741014E-2,1023,449,69,18,20,35,{"$f":"VLOOKUP($A15,[1]Sheet1!$A$29:$I$44,8,FALSE)","v":1614},{"$f":"VLOOKUP($A15,[1]Sheet1!$A$29:$I$44,9,FALSE)","v":50850},0.91201982651796776,2.3543990086741014E-2,{"$f":"VLOOKUP($A15,[1]Sheet1!$A$29:$I$44,2,FALSE)","v":1023},{"$f":"VLOOKUP($A15,[1]Sheet1!$A$29:$I$44,3,FALSE)","v":449},{"$f":"VLOOKUP($A15,[1]Sheet1!$A$29:$I$44,4,FALSE)","v":69},{"$f":"VLOOKUP($A15,[1]Sheet1!$A$29:$I$44,5,FALSE)","v":18},{"$f":"VLOOKUP($A15,[1]Sheet1!$A$29:$I$44,6,FALSE)","v":20},{"$f":"VLOOKUP($A15,[1]Sheet1!$A$29:$I$44,7,FALSE)","v":35}]
{"$rows_left_out":8}
{"sheet":"Trusts","index":3,"n_rows":82,"n_cols":20,"rows_kept":82,"cut":false,"hidden":false,"merged":[[2,6,3,6],[2,7,2,12],[2,13,2,19],[2,0,3,0],[2,1,3,1],[2,2,3,2],[2,3,3,3],[2,4,3,4],[2,5,3,5]]}
[]
[]
["Region (LO) Code","Trust Code","Trust Name","Total Responses","Total Eligible","Percentage Recommended","Percentage Not  Recommended","Breakdown of Responses",null,null,null,null,null,"Mode of Collection"]
[null,null,null,null,null,null,null,"Extremely Likely","Likely","Neither","Unlikely","Extremely Unlikely","Don't Know","SMS/Text / Smartphone App","Electronic tablet/kiosk at point of discharge","Paper / postcard at point of discharge","Paper survey sent to the patients home","Telephone survey once patient is home","Online survey once patient is home","Other"]
[null,null,"England (including Independent Sector Providers)",17577,659941,0.88974227683905105,4.1019514137793707E-2,10919,4720,773,326,395,444,362,2785,9599,1332,731,2128,640]
[null,null,"England (excluding Independent Sector Providers)",16842,646751,0.88843367771048565,4.1384633653960334E-2,10417,4546,745,312,385,437,358,2775,9091,1322,731,2051,514]
[null,null,"Selection (excluding suppressed data)",{"$f":"SUBTOTAL(9,D8:D193)","v":17577},{"$f":"SUBTOTAL(9,E8:E193)","v":659941},{"$f":"IFERROR((H7+I7)/SUM(H7:M7), \"-\")","v":0.88981217985202044},{"$f":"IFERROR((K7+L7)/SUM(H7:M7), \"-\")","v":4.1035856573705176E-2},{"$f":"SUBTOTAL(9,H8:H193)","v":10916},4718,771,326,395,444,362,2779,9598,1332,731,2128,640]
["Q71","RRP","BARNET, ENFIELD AND HARINGEY MENTAL HEALTH NHS TRUST",726,7895,0.87465564738292012,2.8925619834710745E-2,375,260,44,11,10,26,0,59,0,0,0,667,0]
["Q71","TAF","CAMDEN AND ISLINGTON NHS FOUNDATION TRUST",137,1992,0.8978102189781022,3.6496350364963501E-2,81,42,9,2,3,0,0,20,92,19,0,6,0]
["Q71","RV3","CENTRAL AND NORTH WEST LONDON NHS FOUNDATION TRUST",478,18719,0.89748953974895396,4.3933054393305436E-2,323,106,17,10,11,11,0,1,447,0,0,30,0]
["Q71","RWK","EAST LONDON NHS FOUNDATION TRUST",609,14871,0.88669950738916259,3.7766830870279149E-2,353,187,17,8,15,29,0,107,0,0,0,225,277]
["Q71","RAT","NORTH EAST LONDON NHS FOUNDATION TRUST",216,16248,0.89351851851851849,3.2407407407407406E-2,93,100,15,4,3,1,0,0,0,0,206,10,0]
["Q71","RPG","OXLEAS NHS FOUNDATION TRUST",299,8289,0.87290969899665549,4.0133779264214048E-2,180,81,21,6,6,5,10,100,100,89,0,0,0]
["Q71","RAL","ROYAL FREE LONDON NHS FOUNDATION TRUST",33,103,0.93939393939393945,6.0606060606060608E-2,27,4,0,2,0,0,0,0,33,0,0,0,0]
["Q71","RV5","SOUTH LONDON AND MAUDSLEY NHS FOUNDATION TRUST",784,33610,0.83290816326530615,6.6326530612244902E-2,426,227,40,25,27,39,0,319,405,0,0,60,0]
{"$rows_left_out":68}
{"sheet":"Categories","index":4,"n_rows":299,"n_cols":13,"rows_kept":299,"cut":false,"hidden":false,"merged":[[2,6,3,6],[2,7,2,12],[2,0,3,0],[2,1,3,1],[2,2,3,2],[2,3,3,3],[2,4,3,4],[2,5,3,5]]}
[]
[]
["Region (LO) Code","Trust Code","Trust Name","Service Category Provided","Total Responses","Percentage Recommended","Percentage Not  Recommended","Breakdown of Responses"]
[null,null,null,null,null,null,null,"Extremely Likely","Likely","Neither","Unlikely","Extremely Unlikely","Don't Know"]
[null,null,null,"England (including Independent Sector Providers)",17577,0.88974227683905105,4.1019514137793707E-2,10919,4720,773,326,395,444]
[null,null,null,"England (excluding Independent Sector Providers)",16842,0.88843367771048565,4.1384633653960334E-2,10417,4546,745,312,385,437]
[null,null,null,"Selection (excluding suppressed data)",{"$f":"SUBTOTAL(9,E8:E667)","v":17577},{"$f":"IFERROR((H7+I7)/SUM(H7:M7), \"-\")","v":0.88980253633678852},{"$f":"IFERROR((K7+L7)/SUM(H7:M7), \"-\")","v":4.1114135155480923E-2},{"$f":"SUBTOTAL(9,H8:H667)","v":10714},4652,758,322,388,435]
["Q71","RRP","BARNET, ENFIELD AND HARINGEY MENTAL HEALTH NHS TRUST","Acute Services",191,0.92670157068062831,2.0942408376963352E-2,59,118,8,3,1,2]
["Q71","RRP","BARNET, ENFIELD AND HARINGEY MENTAL HEALTH NHS TRUST","Child & Adolescent Mental Health Services",15,0.73333333333333328,6.6666666666666666E-2,7,4,3,0,1,0]
["Q71","RRP","BARNET, ENFIELD AND HARINGEY MENTAL HEALTH NHS TRUST","Secondary Care Community Services",375,0.84799999999999998,2.9333333333333333E-2,220,98,25,4,7,21]
["Q71","RRP","BARNET, ENFIELD AND HARINGEY MENTAL HEALTH NHS TRUST","Secure & Forensic Services",101,0.88118811881188119,4.9504950495049507E-2,63,26,6,4,1,1]
["Q71","RRP","BARNET, ENFIELD AND HARINGEY MENTAL HEALTH NHS TRUST","Specialist Services",44,0.90909090909090906,0,26,14,2,0,0,2]
["Q71","TAF","CAMDEN AND ISLINGTON NHS FOUNDATION TRUST","Acute Services",16,0.5625,0.25,3,6,3,1,3,0]
["Q71","TAF","CAMDEN AND ISLINGTON NHS FOUNDATION TRUST","Primary Care",63,0.93650793650793651,0,42,17,4,0,0,0]
["Q71","TAF","CAMDEN AND ISLINGTON NHS FOUNDATION TRUST","Secondary Care Community Services",53,0.94339622641509435,1.8867924528301886E-2,35,15,2,1,0,0]
{"$rows_left_out":285}
{"sheet":"BS","index":5,"n_rows":293,"n_cols":30,"rows_kept":293,"cut":false,"hidden":true,"merged":[]}
[null,"Sort","Region (LO) Code","Region (LO) name","Trust code","Trust name","Category",null,"Sort Lists:","Sort range…","Sort range…","Sort range…","Reference Region Lists:","Code…","Name…","Linked Region Lists:","Code…","Name…","Reference Lists:","Code…","Code…","Name…","Category…","Trusts Linked Lists:","Code…","Name…","Categories Linked Lists:","Code…","Name…","Category…"]
["Region (LO)",1,1,1,"-","-","-",null,null,"Region (LO) Code","Region (LO) Code","Region (LO) Code",null,"Q72","NHS England Yorkshire & Humber",null,"IS1","Independent Sector Providers",null,"Q71","RRP","BARNET, ENFIELD AND HARINGEY MENTAL HEALTH NHS TRUST","Acute Services",null,"AM5","2GETHER NHS FOUNDATION TRUST",null,"AM5","2GETHER NHS FOUNDATION TRUST","Acute Services"]
["Trusts",1,1,1,1,1,"-",null,null,"Region (Local Office)","Trust Code","Trust Code",null,"Q74","NHS England Cumbria & North East",null,"Q71","NHS England Central Midlands",null,"Q71","RRP","BARNET, ENFIELD AND HARINGEY MENTAL HEALTH NHS TRUST","Child & Adolescent Mental Health Services",null,"DE8","ALDER HEY CHILDREN'S NHS FOUNDATION TRUST",null,"DE8","ALDER HEY CHILDREN'S NHS FOUNDATION TRUST","Child & Adolescent Mental Health Services"]
["Categories",1,1,1,1,1,1,null,null,"Total Responses","Trust Name","Trust Name",null,"Q75","NHS England Cheshire & Merseyside",null,"Q72","NHS England Cheshire & Merseyside",null,"Q71","RRP","BARNET, ENFIELD AND HARINGEY MENTAL HEALTH NHS TRUST","Secondary Care Community Services",null,"NDK","AVON AND WILTSHIRE MENTAL HEALTH PARTNERSHIP NHS TRUST",null,"NDK","AVON AND WILTSHIRE MENTAL HEALTH PARTNERSHIP NHS TRUST","Mental Health Other"]
[null,null,null,null,null,null,null,null,null,"Total Eligible","Total Responses","Category",null,"Q83","NHS England Greater Manchester",null,"Q74","NHS England Cumbria & North East",null,"Q71","RRP","BARNET, ENFIELD AND HARINGEY MENTAL HEALTH NHS TRUST","Secure & Forensic Services",null,"NMJ","BARNET, ENFIELD AND HARINGEY MENTAL HEALTH NHS TRUST",null,"NMJ","BARNET, ENFIELD AND HARINGEY MENTAL HEALTH NHS TRUST","Primary Care"]
[null,null,null,null,null,null,null,null,null,"Percentage Recommended","Total Eligible","Total Responses",null,"Q84","NHS England Lancashire",null,"Q75","NHS England East",null,"Q71","RRP","BARNET, ENFIELD AND HARINGEY MENTAL HEALTH NHS TRUST","Specialist Services",null,"NNF","BERKSHIRE HEALTHCARE NHS FOUNDATION TRUST",null,"NNF","BERKSHIRE HEALTHCARE NHS FOUNDATION TRUST","Secondary Care Community Services"]
[null,null,null,null,null,null,null,null,null,"Percentage Not Recommended","Percentage Recommended","Percentage Recommended",null,"Q76","NHS England North Midlands",null,"Q76","NHS England Greater Manchester",null,"Q71","TAF","CAMDEN AND ISLINGTON NHS FOUNDATION TRUST","Acute Services",null,"NQL","BIRMINGHAM AND SOLIHULL MENTAL HEALTH NHS FOUNDATION TRUST",null,"NQL","BIRMINGHAM AND SOLIHULL MENTAL HEALTH NHS FOUNDATION TRUST","Secure & Forensic Services"]
[null,null,null,null,null,null,null,null,null,"Extremely Likely","Percentage Not Recommended","Percentage Not Recommended",null,"Q77","NHS England West Midlands",null,"Q77","NHS England Hampshire, Isle Of Wight & Thames Valley",null,"Q71","TAF","CAMDEN AND ISLINGTON NHS FOUNDATION TRUST","Primary Care",null,"NR5","BIRMINGHAM WOMEN'S AND CHILDREN'S NHS FOUNDATION TRUST",null,"NR5","BIRMINGHAM WOMEN'S AND CHILDREN'S NHS FOUNDATION TRUST","Specialist Services"]
[null,null,null,null,null,null,null,null,null,"Likely","Extremely Likely","Extremely Likely",null,"Q78","NHS England Central Midlands",null,"Q78","NHS England Kent, Surrey & Sussex",null,"Q71","TAF","CAMDEN AND ISLINGTON NHS FOUNDATION TRUST","Secondary Care Community Services",null,"NV2","BLACK COUNTRY PARTNERSHIP NHS FOUNDATION TRUST",null,"NV2","BLACK COUNTRY PARTNERSHIP NHS FOUNDATION TRUST"]
[null,null,null,null,null,null,null,null,null,"Neither","Likely","Likely",null,"Q79","NHS England East",null,"Q79","NHS England Lancashire",null,"Q71","TAF","CAMDEN AND ISLINGTON NHS FOUNDATION TRUST","Specialist Services",null,"NWX","BLACKPOOL TEACHING HOSPITALS NHS FOUNDATION TRUST",null,"NWX","BLACKPOOL TEACHING HOSPITALS NHS FOUNDATION TRUST"]
[null,null,null,null,null,null,null,null,null,"Unlikely","Neither","Neither",null,"Q85","NHS England South West South",null,"Q83","NHS England London",null,"Q71","RV3","CENTRAL AND NORTH WEST LONDON NHS FOUNDATION TRUST","Acute Services",null,"R1A","BRADFORD DISTRICT CARE NHS FOUNDATION TRUST",null,"R1A","BRADFORD DISTRICT CARE NHS FOUNDATION TRUST"]
[null,null,null,null,null,null,null,null,null,"Extremely Unlikely","Unlikely","Unlikely",null,"Q86","NHS England South West North",null,"Q84","NHS England North Midlands",null,"Q71","RV3","CENTRAL AND NORTH WEST LONDON NHS FOUNDATION TRUST","Child & Adolescent Mental Health Services",null,"R1C","CAMBRIDGESHIRE AND PETERBOROUGH NHS FOUNDATION TRUST",null,"R1C","CAMBRIDGESHIRE AND PETERBOROUGH NHS FOUNDATION TRUST"]
[null,null,null,null,null,null,null,null,null,"Don't Know","Extremely Unlikely","Extremely Unlikely",null,"Q87","NHS England Hampshire, Isle Of Wight & Thames Valley",null,"Q85","NHS England South West North",null,"Q71","RV3","CENTRAL AND NORTH WEST LONDON NHS FOUNDATION TRUST","Mental Health Other",null,"R1F","CAMDEN AND ISLINGTON NHS FOUNDATION TRUST",null,"R1F","CAMDEN AND ISLINGTON NHS FOUNDATION TRUST"]
[null,null,null,null,null,null,null,null,null,null,"Don't Know","Don't Know",null,"Q88","NHS England Kent, Surrey & Sussex",null,"Q86","NHS England South West South",null,"Q71","RV3","CENTRAL AND NORTH WEST LONDON NHS FOUNDATION TRUST","Secondary Care Community Services",null,"R1L","CENTRAL AND NORTH WEST LONDON NHS FOUNDATION TRUST",null,"R1L","CENTRAL AND NORTH WEST LONDON NHS FOUNDATION TRUST"]
[null,null,null,null,null,null,null,null,null,null,"SMS/Text / Smartphone App",null,null,"Q71","NHS England London",null,"Q87","NHS England West Midlands",null,"Q71","RV3","CENTRAL AND NORTH WEST LONDON NHS FOUNDATION TRUST","Specialist Services",null,"RAL","CHESHIRE AND WIRRAL PARTNERSHIP NHS FOUNDATION TRUST",null,"RAL","CHESHIRE AND WIRRAL PARTNERSHIP NHS FOUNDATION TRUST"]
{"$rows_left_out":278}